Build #1,760

FreeRangeRouting Protocol Suite

Build: #1760 failed Changes by Donald Sharp

Build result summary

Details

Completed
Duration
127 minutes
Labels
version=frr-6_1-dev-1405-gac92680d8git=https_//github_com/frrouting/frr_gitbuildurl=https_//ci1_netdef_org/browse/frr-frr-1760branch=master
Revision
ac92680d8ddba0ab3ddf3099b22b75cc81e50ffa ac92680d8ddba0ab3ddf3099b22b75cc81e50ffa
Total tests
7156
Failing since
#1739 (Changes by Donald Sharp)
Fixed in
#1774 (Changes by Donald Sharp and David Lamparter)

Responsible

This build has been failing since #1739
No one has taken responsibility

Code commits

Author Commit Message Commit date
Donald Sharp Donald Sharp ac92680d8ddba0ab3ddf3099b22b75cc81e50ffa ac92680d8ddba0ab3ddf3099b22b75cc81e50ffa Merge pull request #3438 from opensourcerouting/bgp-rfapi-default-value
bgpd: don't show default value in configuration
Donald Sharp Donald Sharp 29dfc63cbf7a8e58f03cc60c7e5b6b762f5be8bb 29dfc63cbf7a8e58f03cc60c7e5b6b762f5be8bb Merge pull request #3437 from opensourcerouting/bugfix/topotests-use-copy
tests/topotests: Use copied tests in Docker
Donald Sharp Donald Sharp bc6f139cd19acaff1beefae9fb14da1962d42c85 bc6f139cd19acaff1beefae9fb14da1962d42c85 Merge pull request #3436 from opensourcerouting/bugfix/topotest-sbin-dir
tests/topotests: Also search sbin for modprobe
Donald Sharp Donald Sharp 3b2298e76b8e641ffda98705cc973f28a5735bb4 3b2298e76b8e641ffda98705cc973f28a5735bb4 Merge pull request #3421 from pguibert6WIND/bgp_lp_finish_called_too_early
bgpd: delay destruction of label pool
Rafael Zalamena Rafael Zalamena d6efeaac3edf7586c79b5abd36cd2432ea436f3b m d6efeaac3edf7586c79b5abd36cd2432ea436f3b bgpd: don't show default value in configuration
Don't show the configuration line `rfp full-table-download off` by
default as it is not the default value, instead only show
`rfp full-table-download on` (the non-default value) when it is
configured.

This standardizes this knob to the FRR default behavior.

Signed-off-by: Rafael Zalamena <rzalamena@opensourcerouting.org>

Configuration changes

Plan configuration has changed since the last successful build. See the plan audit log for more details.

Tests

New test failures 3
Status Test View job Duration
Collapse Failed test_bfd_topo1 test_bgp_convergence History
Topology Tests on Ubuntu 16.04 arm7 36 secs
AssertionError: r1: bgp did not converge assert json["ipv4Unicast"]["peers"]["192.168.0.2"]["state"] value is different (   --- Expected value   +++ Current value   @@ -1 +1 @@   -"Established"   +"Idle")
E   AssertionError: r1: bgp did not converge
    assert json["ipv4Unicast"]["peers"]["192.168.0.2"]["state"] value is different (
      --- Expected value
      +++ Current value
      @@ -1 +1 @@
      -"Established"
      +"Idle")
Collapse Failed test_bfd_topo1 test_bgp_fast_convergence History
Topology Tests on Ubuntu 16.04 arm7 1 min
AssertionError: r4: bgp did not converge assert expected key(s) [u'10.254.254.1/32'] in json["routes"] (have [u'10.254.254.4/32', u'10.254.254.3/32', u'10.254.254.2/32']):   --- Expected value   +++ Current value   @@ -2 +2 @@   -    "10.254.254.1/32": [   +    "10.254.254.2/32": [   @@ -4 +4,5 @@   -            "aspath": "102 101",    +            "aspath": "102",    +            "bestpath": true,    +            "med": 0,    +            "metric": 0,    +            "network": "10.254.254.2/32",    @@ -11,0 +16,3 @@   +            "origin": "IGP",    +            "path": "102",    +            "pathFrom": "external",    @@ -13 +20 @@   -            "prefix": "10.254.254.1",    +            "prefix": "10.254.254.2",    @@ -15 +22,2 @@   -            "valid": true   +            "valid": true,    +            "weight": 0   @@ -18 +26 @@   -    "10.254.254.2/32": [   +    "10.254.254.3/32": [   @@ -20 +28,3 @@   -            "aspath": "102",    +            "aspath": "102 103",    +            "bestpath": true,    +            "network": "10.254.254.3/32",    @@ -27,0 +38,3 @@   +            "origin": "IGP",    +            "path": "102 103",    +            "pathFrom": "external",    @@ -29 +42 @@   -            "prefix": "10.254.254.2",    +            "prefix": "10.254.254.3",    @@ -31 +44,2 @@   -            "valid": true   +            "valid": true,    +            "weight": 0   @@ -34 +48 @@   -    "10.254.254.3/32": [   +    "10.254.254.4/32": [   @@ -36 +50,5 @@   -            "aspath": "102 103",    +            "aspath": "",    +            "bestpath": true,    +            "med": 0,    +            "metric": 0,    +            "network": "10.254.254.4/32",    @@ -40 +58 @@   -                    "ip": "192.168.2.2",    +                    "ip": "0.0.0.0",    @@ -44,2 +62,5 @@   -            "peerId": "192.168.2.2",    -            "prefix": "10.254.254.3",    +            "origin": "IGP",    +            "path": "",    +            "pathFrom": "external",    +            "peerId": "(unspec)",    +            "prefix": "10.254.254.4",    @@ -47 +68,2 @@   -            "valid": true   +            "valid": true,    +            "weight": 32768
E   AssertionError: r4: bgp did not converge
    assert expected key(s) [u'10.254.254.1/32'] in json["routes"] (have [u'10.254.254.4/32', u'10.254.254.3/32', u'10.254.254.2/32']):
      --- Expected value
      +++ Current value
      @@ -2 +2 @@
      -    "10.254.254.1/32": [
      +    "10.254.254.2/32": [
(62 more lines...)
Collapse Failed test_bgp_l3vpn_to_bgp_direct test_adjacencies History
Topology Tests on Ubuntu 16.04 arm7 1 min
AssertionError: 3 tests failed
E   AssertionError: 3 tests failed
Existing test failures 7
Status Test Failing since View job Duration
AssertionError: 3 tests failed
E   AssertionError: 3 tests failed
AssertionError: 3 tests failed
E   AssertionError: 3 tests failed
AssertionError: IPv4 Zebra Routing Table verification failed for router r2:   --- actual IPv4 zebra routing table   +++ expected IPv4 zebra routing table   @@ -1,6 +1,6 @@    O>* 1.1.1.1/32 [110/10] via 10.0.1.1, r2-eth0, label implicit-null    O   2.2.2.2/32 [110/0] is directly connected, lo   -O>  3.3.3.3/32 [110/10] via 10.0.2.3, r2-eth1   +O>* 3.3.3.3/32 [110/10] via 10.0.2.3, r2-eth1, label implicit-null    O>* 4.4.4.4/32 [110/10] via 10.0.2.4, r2-eth1, label implicit-null    O   10.0.1.0/24 [110/10] is directly connected, r2-eth0    O   10.0.2.0/24 [110/10] is directly connected, r2-eth1 assert 1 == 0
E   AssertionError: IPv4 Zebra Routing Table verification failed for router r2:
      --- actual IPv4 zebra routing table
      +++ expected IPv4 zebra routing table
      @@ -1,6 +1,6 @@
       O>* 1.1.1.1/32 [110/10] via 10.0.1.1, r2-eth0, label implicit-null
       O   2.2.2.2/32 [110/0] is directly connected, lo
      -O>  3.3.3.3/32 [110/10] via 10.0.2.3, r2-eth1
(5 more lines...)
AssertionError: MPLS table output for router r2:   --- actual MPLS table output   +++ expected MPLS table output   @@ -2,5 +2,6 @@       Label     Type          Nexthop     Label    --------  -------  ---------------  --------          XX      LDP         10.0.1.1  implicit-null   +      XX      LDP         10.0.2.3  implicit-null          XX      LDP         10.0.2.4  implicit-null          XX      LDP         10.0.3.3  implicit-null assert 1 == 0
E   AssertionError: MPLS table output for router r2:
      --- actual MPLS table output
      +++ expected MPLS table output
      @@ -2,5 +2,6 @@
          Label     Type          Nexthop     Label
       --------  -------  ---------------  --------
             XX      LDP         10.0.1.1  implicit-null
(4 more lines...)
AssertionError: Linux Kernel MPLS route output for router r2:   --- actual Linux Kernel MPLS route   +++ expected Linux Kernel MPLS route   @@ -1,3 +1,3 @@   +xx proto xx nexthopvia inet 10.0.2.3 dev r2-eth1 nexthopvia inet 10.0.3.3 dev r2-eth2    xx via inet 10.0.1.1 dev r2-eth0 proto xx    xx via inet 10.0.2.4 dev r2-eth1 proto xx   -xx via inet 10.0.3.3 dev r2-eth2 proto xx assert 1 == 0
E   AssertionError: Linux Kernel MPLS route output for router r2:
      --- actual Linux Kernel MPLS route
      +++ expected Linux Kernel MPLS route
      @@ -1,3 +1,3 @@
      +xx proto xx nexthopvia inet 10.0.2.3 dev r2-eth1 nexthopvia inet 10.0.3.3 dev r2-eth2
       xx via inet 10.0.1.1 dev r2-eth0 proto xx
       xx via inet 10.0.2.4 dev r2-eth1 proto xx
(2 more lines...)
AssertionError: MPLS LDP Interface binding output for router r2:   --- actual MPLS LDP binding output   +++ expected MPLS LDP binding output   @@ -1,5 +1,6 @@    AF   Destination          Nexthop         Local Label Remote Label  In Use    ipv4 1.1.1.1/32           1.1.1.1         xxx         imp-null         yes   +ipv4 1.1.1.1/32           3.3.3.3         xxx         xxx               no    ipv4 1.1.1.1/32           4.4.4.4         xxx         xxx               no    ipv4 2.2.2.2/32           1.1.1.1         imp-null    xxx               no    ipv4 2.2.2.2/32           3.3.3.3         imp-null    xxx               no assert 1 == 0
E   AssertionError: MPLS LDP Interface binding output for router r2:
      --- actual MPLS LDP binding output
      +++ expected MPLS LDP binding output
      @@ -1,5 +1,6 @@
       AF   Destination          Nexthop         Local Label Remote Label  In Use
       ipv4 1.1.1.1/32           1.1.1.1         xxx         imp-null         yes
      +ipv4 1.1.1.1/32           3.3.3.3         xxx         xxx               no
(4 more lines...)
AssertionError: "r1" JSON output mismatches the expected result assert json value is different (   --- Expected value   +++ Current value   @@ -3,0 +4,2 @@   +        "internalFlags": 16,    +        "internalStatus": 2,    @@ -9 +11 @@   -                "fib": true,    +                "flags": 1,    @@ -17 +19 @@   -                "fib": true,    +                "flags": 1,    @@ -25 +27,2 @@   -        "selected": true   +        "selected": true,    +        "uptime": "00:03:38")
E   AssertionError: "r1" JSON output mismatches the expected result
    assert json value is different (
      --- Expected value
      +++ Current value
      @@ -3,0 +4,2 @@
      +        "internalFlags": 16, 
      +        "internalStatus": 2, 
(10 more lines...)