Build #1,827

FreeRangeRouting Protocol Suite

Build: #1827 failed Changes by Donald Sharp

Build result summary

Details

Completed
Duration
132 minutes
Labels
version=frr-6_1-dev-1728-g4bfbcbdbbgit=https_//github_com/frrouting/frr_gitbuildurl=https_//ci1_netdef_org/browse/frr-frr-1827branch=master
Revision
4bfbcbdbb218066aa85f05062f1bf8885165e1ac 4bfbcbdbb218066aa85f05062f1bf8885165e1ac
Total tests
7040
Failing since
#1826 (Changes by Donald Sharp)
Fixed in
#1829 (Changes by Mark Stapp <mjs@voltanet.io>)

Responsible

Code commits

Author Commit Message Commit date
Donald Sharp Donald Sharp 4bfbcbdbb218066aa85f05062f1bf8885165e1ac 4bfbcbdbb218066aa85f05062f1bf8885165e1ac Merge pull request #3566 from pguibert6WIND/fix_vrf_netns_broken
zebra: fix vrf netns broken
Philippe Guibert Philippe Guibert 3f6e9ae5bccc6d7f8c42a01a99ce531690adaa2c m 3f6e9ae5bccc6d7f8c42a01a99ce531690adaa2c zebra: update local ns_id field
ns_id field must be synced with ns_id from netns service.

Signed-off-by: Philippe Guibert <philippe.guibert@6wind.com>

Tests

New test failures 6
Status Test View job Duration
Collapse Failed test_bfd_topo1 test_bgp_convergence History
Topology Tests on Ubuntu 16.04 i386 22 secs
AssertionError: r2: bgp did not converge assert json["ipv4Unicast"]["peers"]["192.168.1.1"]["state"] value is different (   --- Expected value   +++ Current value   @@ -1 +1 @@   -"Established"   +"Idle")
E   AssertionError: r2: bgp did not converge
    assert json["ipv4Unicast"]["peers"]["192.168.1.1"]["state"] value is different (
      --- Expected value
      +++ Current value
      @@ -1 +1 @@
      -"Established"
      +"Idle")
Collapse Failed test_bfd_topo1 test_bgp_fast_convergence History
Topology Tests on Ubuntu 16.04 i386 40 secs
AssertionError: r4: bgp did not converge assert expected key(s) [u'10.254.254.3/32'] in json["routes"] (have [u'10.254.254.4/32', u'10.254.254.2/32', u'10.254.254.1/32']):   --- Expected value   +++ Current value   @@ -4,0 +5,2 @@   +            "bestpath": true,    +            "network": "10.254.254.1/32",    @@ -11,0 +14,3 @@   +            "origin": "IGP",    +            "path": "102 101",    +            "pathFrom": "external",    @@ -15 +20,2 @@   -            "valid": true   +            "valid": true,    +            "weight": 0   @@ -20,0 +27,4 @@   +            "bestpath": true,    +            "med": 0,    +            "metric": 0,    +            "network": "10.254.254.2/32",    @@ -27,0 +38,3 @@   +            "origin": "IGP",    +            "path": "102",    +            "pathFrom": "external",    @@ -31 +44,2 @@   -            "valid": true   +            "valid": true,    +            "weight": 0   @@ -34 +48 @@   -    "10.254.254.3/32": [   +    "10.254.254.4/32": [   @@ -36 +50,5 @@   -            "aspath": "102 103",    +            "aspath": "",    +            "bestpath": true,    +            "med": 0,    +            "metric": 0,    +            "network": "10.254.254.4/32",    @@ -40 +58 @@   -                    "ip": "192.168.2.2",    +                    "ip": "0.0.0.0",    @@ -44,2 +62,5 @@   -            "peerId": "192.168.2.2",    -            "prefix": "10.254.254.3",    +            "origin": "IGP",    +            "path": "",    +            "pathFrom": "external",    +            "peerId": "(unspec)",    +            "prefix": "10.254.254.4",    @@ -47 +68,2 @@   -            "valid": true   +            "valid": true,    +            "weight": 32768
E   AssertionError: r4: bgp did not converge
    assert expected key(s) [u'10.254.254.3/32'] in json["routes"] (have [u'10.254.254.4/32', u'10.254.254.2/32', u'10.254.254.1/32']):
      --- Expected value
      +++ Current value
      @@ -4,0 +5,2 @@
      +            "bestpath": true, 
      +            "network": "10.254.254.1/32", 
(46 more lines...)
Collapse Failed test_bfd_topo1 test_bgp_fast_reconvergence History
Topology Tests on Ubuntu 16.04 i386 6 secs
AssertionError: r4: bgp did not converge assert expected key(s) [u'10.254.254.3/32'] in json["routes"] (have [u'10.254.254.4/32', u'10.254.254.2/32']):   --- Expected value   +++ Current value   @@ -2 +1,0 @@   -    "10.254.254.1/32": null,    @@ -5,0 +5,4 @@   +            "bestpath": true,    +            "med": 0,    +            "metric": 0,    +            "network": "10.254.254.2/32",    @@ -12,0 +16,3 @@   +            "origin": "IGP",    +            "path": "102",    +            "pathFrom": "external",    @@ -16 +22,2 @@   -            "valid": true   +            "valid": true,    +            "weight": 0   @@ -19 +26 @@   -    "10.254.254.3/32": [   +    "10.254.254.4/32": [   @@ -21 +28,5 @@   -            "aspath": "102 103",    +            "aspath": "",    +            "bestpath": true,    +            "med": 0,    +            "metric": 0,    +            "network": "10.254.254.4/32",    @@ -25 +36 @@   -                    "ip": "192.168.2.2",    +                    "ip": "0.0.0.0",    @@ -29,2 +40,5 @@   -            "peerId": "192.168.2.2",    -            "prefix": "10.254.254.3",    +            "origin": "IGP",    +            "path": "",    +            "pathFrom": "external",    +            "peerId": "(unspec)",    +            "prefix": "10.254.254.4",    @@ -32 +46,2 @@   -            "valid": true   +            "valid": true,    +            "weight": 32768
E   AssertionError: r4: bgp did not converge
    assert expected key(s) [u'10.254.254.3/32'] in json["routes"] (have [u'10.254.254.4/32', u'10.254.254.2/32']):
      --- Expected value
      +++ Current value
      @@ -2 +1,0 @@
      -    "10.254.254.1/32": null, 
      @@ -5,0 +5,4 @@
(37 more lines...)
Collapse Failed test_bfd_topo1 test_bgp_convergence History
Topology Tests on Ubuntu 18.04 amd64 21 secs
AssertionError: r2: bgp did not converge assert json["ipv4Unicast"]["peers"]["192.168.1.1"]["state"] value is different (   --- Expected value   +++ Current value   @@ -1 +1 @@   -"Established"   +"OpenConfirm")
E   AssertionError: r2: bgp did not converge
    assert json["ipv4Unicast"]["peers"]["192.168.1.1"]["state"] value is different (
      --- Expected value
      +++ Current value
      @@ -1 +1 @@
      -"Established"
      +"OpenConfirm")
Collapse Failed test_bfd_topo1 test_bgp_fast_convergence History
Topology Tests on Ubuntu 18.04 amd64 40 secs
AssertionError: r4: bgp did not converge assert expected key(s) [u'10.254.254.3/32'] in json["routes"] (have [u'10.254.254.4/32', u'10.254.254.2/32', u'10.254.254.1/32']):   --- Expected value   +++ Current value   @@ -4,0 +5,2 @@   +            "bestpath": true,    +            "network": "10.254.254.1/32",    @@ -11,0 +14,3 @@   +            "origin": "IGP",    +            "path": "102 101",    +            "pathFrom": "external",    @@ -15 +20,2 @@   -            "valid": true   +            "valid": true,    +            "weight": 0   @@ -20,0 +27,4 @@   +            "bestpath": true,    +            "med": 0,    +            "metric": 0,    +            "network": "10.254.254.2/32",    @@ -27,0 +38,3 @@   +            "origin": "IGP",    +            "path": "102",    +            "pathFrom": "external",    @@ -31 +44,2 @@   -            "valid": true   +            "valid": true,    +            "weight": 0   @@ -34 +48 @@   -    "10.254.254.3/32": [   +    "10.254.254.4/32": [   @@ -36 +50,5 @@   -            "aspath": "102 103",    +            "aspath": "",    +            "bestpath": true,    +            "med": 0,    +            "metric": 0,    +            "network": "10.254.254.4/32",    @@ -40 +58 @@   -                    "ip": "192.168.2.2",    +                    "ip": "0.0.0.0",    @@ -44,2 +62,5 @@   -            "peerId": "192.168.2.2",    -            "prefix": "10.254.254.3",    +            "origin": "IGP",    +            "path": "",    +            "pathFrom": "external",    +            "peerId": "(unspec)",    +            "prefix": "10.254.254.4",    @@ -47 +68,2 @@   -            "valid": true   +            "valid": true,    +            "weight": 32768
E   AssertionError: r4: bgp did not converge
    assert expected key(s) [u'10.254.254.3/32'] in json["routes"] (have [u'10.254.254.4/32', u'10.254.254.2/32', u'10.254.254.1/32']):
      --- Expected value
      +++ Current value
      @@ -4,0 +5,2 @@
      +            "bestpath": true, 
      +            "network": "10.254.254.1/32", 
(46 more lines...)
Collapse Failed test_bfd_topo1 test_bgp_fast_reconvergence History
Topology Tests on Ubuntu 18.04 amd64 5 secs
AssertionError: r4: bgp did not converge assert expected key(s) [u'10.254.254.3/32'] in json["routes"] (have [u'10.254.254.4/32', u'10.254.254.2/32']):   --- Expected value   +++ Current value   @@ -2 +1,0 @@   -    "10.254.254.1/32": null,    @@ -5,0 +5,4 @@   +            "bestpath": true,    +            "med": 0,    +            "metric": 0,    +            "network": "10.254.254.2/32",    @@ -12,0 +16,3 @@   +            "origin": "IGP",    +            "path": "102",    +            "pathFrom": "external",    @@ -16 +22,2 @@   -            "valid": true   +            "valid": true,    +            "weight": 0   @@ -19 +26 @@   -    "10.254.254.3/32": [   +    "10.254.254.4/32": [   @@ -21 +28,5 @@   -            "aspath": "102 103",    +            "aspath": "",    +            "bestpath": true,    +            "med": 0,    +            "metric": 0,    +            "network": "10.254.254.4/32",    @@ -25 +36 @@   -                    "ip": "192.168.2.2",    +                    "ip": "0.0.0.0",    @@ -29,2 +40,5 @@   -            "peerId": "192.168.2.2",    -            "prefix": "10.254.254.3",    +            "origin": "IGP",    +            "path": "",    +            "pathFrom": "external",    +            "peerId": "(unspec)",    +            "prefix": "10.254.254.4",    @@ -32 +46,2 @@   -            "valid": true   +            "valid": true,    +            "weight": 32768
E   AssertionError: r4: bgp did not converge
    assert expected key(s) [u'10.254.254.3/32'] in json["routes"] (have [u'10.254.254.4/32', u'10.254.254.2/32']):
      --- Expected value
      +++ Current value
      @@ -2 +1,0 @@
      -    "10.254.254.1/32": null, 
      @@ -5,0 +5,4 @@
(37 more lines...)