Build #1,917

FreeRangeRouting Protocol Suite

Build: #1917 failed Changes by David Lamparter

Build result summary

Details

Completed
Duration
125 minutes
Labels
version=frr-7_1-dev-161-ge7f0060c1git=https_//github_com/frrouting/frr_gitbuildurl=https_//ci1_netdef_org/browse/frr-frr-1917branch=master
Revision
e7f0060c12c4f37796df100fd205dbbaa7dfcf1a e7f0060c12c4f37796df100fd205dbbaa7dfcf1a
Total tests
6619
Fixed in
#1918 (Changes by David Lamparter)

Responsible

Code commits

Author Commit Message Commit date
David Lamparter David Lamparter e7f0060c12c4f37796df100fd205dbbaa7dfcf1a e7f0060c12c4f37796df100fd205dbbaa7dfcf1a Merge pull request #3744 from mjstapp/wq_deprecated_api
libs: remove deprecated workqueue api
Mark Stapp <mjs@voltanet.io> Mark Stapp <mjs@voltanet.io> 49f36252d60195112caada649d94cce3bb9d496e m 49f36252d60195112caada649d94cce3bb9d496e libs: remove deprecated workqueue api
Remove deprecated api from workqueue module.

Signed-off-by: Mark Stapp <mjs@voltanet.io>

Tests

New test failures 2
Status Test View job Duration
Collapse Failed test_ospf_topo1 test_ospf6_link_down History
Topology Tests on Ubuntu 16.04 amd64 1 min
AssertionError: OSPF6 did not converge on r1:   --- Current output   +++ Expected output   @@ -3,4 +3,3 @@     N E1 2001:db8:2::/64 fe80::xxxx:xxxx:xxxx:xxxx r1-eth1    *N IA 2001:db8:3::/64 :: r1-eth1     N E1 2001:db8:3::/64 fe80::xxxx:xxxx:xxxx:xxxx r1-eth1   -*N E1 fe80::xxxx:xxxx:xxxx:xxxx fe80::xxxx:xxxx:xxxx:xxxx r1-eth1 assert False
E   AssertionError: OSPF6 did not converge on r1:
      --- Current output
      +++ Expected output
      @@ -3,4 +3,3 @@
        N E1 2001:db8:2::/64 fe80::xxxx:xxxx:xxxx:xxxx r1-eth1
       *N IA 2001:db8:3::/64 :: r1-eth1
        N E1 2001:db8:3::/64 fe80::xxxx:xxxx:xxxx:xxxx r1-eth1
(2 more lines...)
Collapse Failed test_ospf_topo1 test_ospf6_convergence History
Topology Tests on Ubuntu 16.04 amd64 1 min
AssertionError: OSPF6 did not converge on r1:   --- Current output   +++ Expected output   @@ -11,4 +11,3 @@     N E1 2001:db8:200::/64 fe80::xxxx:xxxx:xxxx:xxxx r1-eth1    *N IE 2001:db8:300::/64 fe80::xxxx:xxxx:xxxx:xxxx r1-eth1     N E1 2001:db8:300::/64 fe80::xxxx:xxxx:xxxx:xxxx r1-eth1   -*N E1 fe80::xxxx:xxxx:xxxx:xxxx fe80::xxxx:xxxx:xxxx:xxxx r1-eth1 assert False
E   AssertionError: OSPF6 did not converge on r1:
      --- Current output
      +++ Expected output
      @@ -11,4 +11,3 @@
        N E1 2001:db8:200::/64 fe80::xxxx:xxxx:xxxx:xxxx r1-eth1
       *N IE 2001:db8:300::/64 fe80::xxxx:xxxx:xxxx:xxxx r1-eth1
        N E1 2001:db8:300::/64 fe80::xxxx:xxxx:xxxx:xxxx r1-eth1
(2 more lines...)