Build #2,095

FreeRangeRouting Protocol Suite

Build: #2095 failed Changes by Russ White <russ@riw.us>

Build result summary

Details

Completed
Duration
139 minutes
Labels
version=frr-7_1-dev-840-gbfb1d6a7bgit=https_//github_com/frrouting/frr_gitbuildurl=https_//ci1_netdef_org/browse/frr-frr-2095branch=master
Revision
bfb1d6a7bf738a17c23e525c4c0e96f4fb379aaf bfb1d6a7bf738a17c23e525c4c0e96f4fb379aaf
Total tests
6651
Fixed in
#2096 (Changes by Russ White <russ@riw.us>)

Tests

Responsible

No one has taken responsibility for this failure

Code commits

Author Commit Message Commit date
Russ White <russ@riw.us> Russ White <russ@riw.us> bfb1d6a7bf738a17c23e525c4c0e96f4fb379aaf bfb1d6a7bf738a17c23e525c4c0e96f4fb379aaf Merge pull request #4094 from mjstapp/dplane_system_routes
zebra: dataplane notifications for system route changes
Mark Stapp <mjs@voltanet.io> Mark Stapp <mjs@voltanet.io> cf363e1bd86a2594aa3698d4e6561cfe14ea7d9a m cf363e1bd86a2594aa3698d4e6561cfe14ea7d9a zebra: dataplane notifications for system route changes
Add notifications from zebra to the dataplane subsystem when
kernel or connected routes change.

Signed-off-by: Mark Stapp <mjs@voltanet.io>

Tests

New test failures 3
Status Test View job Duration
Collapse Failed test_bfd_topo2 test_protocols_convergence History
Topology Tests on Ubuntu 16.04 amd64 2 mins
AssertionError: "r3" JSON output mismatches assert json value is different (   --- Expected value   +++ Current value   @@ -5 +5 @@   -        "internalStatus": 0,    +        "internalStatus": 2,    @@ -17 +17,2 @@   -        "protocol": "ospf"   +        "protocol": "ospf",    +        "uptime": "00:02:41"   @@ -19,0 +21 @@   +        "destSelected": true,    @@ -37 +39,2 @@   -        "selected": true   +        "selected": true,    +        "uptime": "00:02:43")
E   AssertionError: "r3" JSON output mismatches
    assert json value is different (
      --- Expected value
      +++ Current value
      @@ -5 +5 @@
      -        "internalStatus": 0, 
      +        "internalStatus": 2, 
(10 more lines...)
Collapse Failed test_bfd_topo2 test_protocols_convergence History
Topology Tests on Ubuntu 16.04 arm8 3 mins
AssertionError: "r1" JSON output mismatches assert json value is different (   --- Expected value   +++ Current value   @@ -2,0 +3 @@   +        "destSelected": true,    @@ -4 +5 @@   -        "installed": true,    +        "failed": true,    @@ -6 +7 @@   -        "internalStatus": 34,    +        "internalStatus": 66,    @@ -12,2 +13 @@   -                "fib": true,    -                "flags": 3,    +                "flags": 1,    @@ -15 +15,2 @@   -                "interfaceName": "r1-eth0"   +                "interfaceName": "r1-eth0",    +                "ip": "fe80::302c:ebff:fe07:f02c"   @@ -20 +21,2 @@   -        "selected": true   +        "selected": true,    +        "uptime": "00:02:47")
E   AssertionError: "r1" JSON output mismatches
    assert json value is different (
      --- Expected value
      +++ Current value
      @@ -2,0 +3 @@
      +        "destSelected": true, 
      @@ -4 +5 @@
(17 more lines...)
Collapse Failed test_bgp_l3vpn_to_bgp_direct test_adjacencies History
Topology Tests on Ubuntu 18.04 amd64 1 min
AssertionError: 1 tests failed
E   AssertionError: 1 tests failed