Build #2,206

FreeRangeRouting Protocol Suite

Build: #2206 failed Changes by Donald Sharp and Lou Berger

Build result summary

Details

Completed
Duration
139 minutes
Labels
version=frr-7_1-dev-1234-gcf277e9e7git=https_//github_com/frrouting/frr_gitbuildurl=https_//ci1_netdef_org/browse/frr-frr-2206branch=master
Revision
cf277e9e7977616272101517633d797c5b100024 cf277e9e7977616272101517633d797c5b100024
Total tests
7697
Failing since
#2203 (Changes by Donald Sharp)
Fixed in
#2207 (Changes by Donald Sharp)

Responsible

Code commits

Author Commit Message Commit date
Lou Berger Lou Berger cf277e9e7977616272101517633d797c5b100024 cf277e9e7977616272101517633d797c5b100024 Merge pull request #4341 from donaldsharp/bgp_attr_should_actually_compile
bgpd: Fix non-compilation of bgp_attr_extcom_tunnel_type
Donald Sharp Donald Sharp fa34668617510c1d6e88f1c665f25b68db07d805 fa34668617510c1d6e88f1c665f25b68db07d805 bgpd: Fix non-compilation of bgp_attr_extcom_tunnel_type
The bgp_attr_extcom_tunnel_type does not properly
compile with warnings turned on due to recent change.

Signed-off-by: Donald Sharp <sharpd@cumulusnetworks.com>

Tests

New test failures 1
Status Test View job Duration
Collapse Failed test_ospf6_topo1 test_linux_ipv6_kernel_routingTable History
Topology Tests on Ubuntu 16.04 i386 < 1 sec
AssertionError: Linux Kernel IPv6 Routing Table verification failed for router r3:   --- actual OSPFv3 IPv6 routing table   +++ expected OSPFv3 IPv6 routing table   @@ -4,7 +4,7 @@    fc00:2:2:2::/64 via fe80::__(r2-sw5)__ dev r3-sw5 proto XXXX metric 20 pref medium    fc00:3333:3333:3333::/64 via fc00:3:3:3::1234 dev r3-stubnet proto XXXX metric 20 pref medium    fc00:3:3:3::/64 dev r3-stubnet proto XXXX metric 256 pref medium   -fc00:4444:4444:4444::/64 via fe80::95ff:fe1a:e766 dev r3-sw6 proto XXXX metric 20 pref medium   -fc00:4:4:4::/64 via fe80::95ff:fe1a:e766 dev r3-sw6 proto XXXX metric 20 pref medium   +fc00:4444:4444:4444::/64 via fe80::__(r4-sw6)__ dev r3-sw6 proto XXXX metric 20 pref medium   +fc00:4:4:4::/64 via fe80::__(r4-sw6)__ dev r3-sw6 proto XXXX metric 20 pref medium    fc00:a:a:a::/64 dev r3-sw5 proto XXXX metric 256 pref medium    fc00:b:b:b::/64 dev r3-sw6 proto XXXX metric 256 pref medium assert 1 == 0   -1   +0
E   AssertionError: Linux Kernel IPv6 Routing Table verification failed for router r3:
      --- actual OSPFv3 IPv6 routing table
      +++ expected OSPFv3 IPv6 routing table
      @@ -4,7 +4,7 @@
       fc00:2:2:2::/64 via fe80::__(r2-sw5)__ dev r3-sw5 proto XXXX metric 20 pref medium
       fc00:3333:3333:3333::/64 via fc00:3:3:3::1234 dev r3-stubnet proto XXXX metric 20 pref medium
       fc00:3:3:3::/64 dev r3-stubnet proto XXXX metric 256 pref medium
(9 more lines...)
Existing test failures 1
Status Test Failing since View job Duration
AssertionError: 2 tests failed
E   AssertionError: 2 tests failed