Build #2,208

FreeRangeRouting Protocol Suite

Build: #2208 failed Changes by Russ White <russ@riw.us>

Build result summary

Details

Completed
Duration
135 minutes
Labels
version=frr-7_1-dev-1243-g6f33cbff1git=https_//github_com/frrouting/frr_gitbuildurl=https_//ci1_netdef_org/browse/frr-frr-2208branch=master
Revision
6f33cbff181010025cb2c9f80aad3c12696e19b0 6f33cbff181010025cb2c9f80aad3c12696e19b0
Total tests
7705
Fixed in
#2215 (Changes by 3 people)

Tests

Responsible

No one has taken responsibility for this failure

Code commits

Author Commit Message Commit date
Russ White <russ@riw.us> Russ White <russ@riw.us> 6f33cbff181010025cb2c9f80aad3c12696e19b0 6f33cbff181010025cb2c9f80aad3c12696e19b0 Merge pull request #4340 from qlyoung/hash-key-const
lib: hashing functions should take const arguments
Russ White <russ@riw.us> Russ White <russ@riw.us> caca2c705c779e536ca4432912a5a8b1d5cc825a caca2c705c779e536ca4432912a5a8b1d5cc825a Merge pull request #4339 from sworleys/Add-AFI_UNSPEC
lib,bgpd,pbrd: Add AFI_UNSPEC to AFI enum
Quentin Young Quentin Young d8b87afe7c5fcee9caaef7124d5bcd5f0c3af8a1 m d8b87afe7c5fcee9caaef7124d5bcd5f0c3af8a1 lib: hashing functions should take const arguments
It doesn't make much sense for a hash function to modify its argument,
so const the hash input.

BGP does it in a couple places, those cast away the const. Not great but
not any worse than it was.

Signed-off-by: Quentin Young <qlyoung@cumulusnetworks.com>
Stephen Worley <sworley@cumulusnetworks.com> Stephen Worley <sworley@cumulusnetworks.com> b26f891dca50643e68dc24f1a097438b80638dd4 m b26f891dca50643e68dc24f1a097438b80638dd4 lib,bgpd,pbrd: Add AFI_UNSPEC to AFI enum
Add an upspecified option to the AFI enum and update
switch statements using it in bgpd and pbrd.

Signed-off-by: Stephen Worley <sworley@cumulusnetworks.com>

Tests

New test failures 2
Status Test View job Duration
Collapse Failed test_bgp_l3vpn_to_bgp_vrf test_adjacencies History
Topology Tests on Ubuntu 16.04 arm8 5 mins
AssertionError: 2 tests failed
E   AssertionError: 2 tests failed
Collapse Failed test_bgp_l3vpn_to_bgp_vrf test_check_scale_down History
Topology Tests on Ubuntu 18.04 amd64 23 secs
AssertionError: 1 tests failed
E   AssertionError: 1 tests failed