Build #2,467

FreeRangeRouting Protocol Suite

Build: #2467 failed Changes by Quentin Young

Build result summary

Details

Completed
Duration
173 minutes
Labels
version=frr-7_1-dev-2304-g0870ea2eagit=https_//github_com/frrouting/frr_gitbuildurl=https_//ci1_netdef_org/browse/frr-frr-2467branch=master
Revision
0870ea2ea63a49efdf3d17f6790d2f4fce4414e0 0870ea2ea63a49efdf3d17f6790d2f4fce4414e0
Total tests
8812
Failing since
#2455 (Rebuilt by Martin Winter)

Responsible

Code commits

Author Commit Message Commit date
Quentin Young Quentin Young 0870ea2ea63a49efdf3d17f6790d2f4fce4414e0 0870ea2ea63a49efdf3d17f6790d2f4fce4414e0 Merge pull request #4823 from mjstapp/fix_dplane_thread_name
zebra: make the dplane pthread name consistent
Mark Stapp <mjs@voltanet.io> Mark Stapp <mjs@voltanet.io> 0eca319cc0205f461d3bdcc928fa5ddbdbd86b35 m 0eca319cc0205f461d3bdcc928fa5ddbdbd86b35 zebra: make the dplane pthread name consistent
Make the dplane pthread's name consistent (lower-case)
with other pthreads.

Signed-off-by: Mark Stapp <mjs@voltanet.io>

Configuration changes

Plan configuration has changed since the last successful build. See the plan audit log for more details.

Tests

Existing test failures 37
Status Test Failing since View job Duration
AssertionError:  r1: zebra has memory leaks:  r1: bgpd has memory leaks:
E   AssertionError: 
    r1: zebra has memory leaks:
    
    r1: bgpd has memory leaks:
AssertionError:  r1: zebra has memory leaks:  r1: bgpd has memory leaks:
E   AssertionError: 
    r1: zebra has memory leaks:
    
    r1: bgpd has memory leaks:
AssertionError:  r4: zebra has memory leaks:  r4: bgpd has memory leaks:
E   AssertionError: 
    r4: zebra has memory leaks:
    
    r4: bgpd has memory leaks:
AssertionError:  r4: zebra has memory leaks:  r4: bgpd has memory leaks:
E   AssertionError: 
    r4: zebra has memory leaks:
    
    r4: bgpd has memory leaks:
AssertionError:  r4: zebra has memory leaks:  r4: bgpd has memory leaks:
E   AssertionError: 
    r4: zebra has memory leaks:
    
    r4: bgpd has memory leaks:
test teardown failure
E   AssertionError: 
    r4: zebra has memory leaks:
    
    r4: bgpd has memory leaks:
    
    r1: zebra has memory leaks:
    
(9 more lines...)
test teardown failure
E   AssertionError: 
    r1: zebra has memory leaks:
    
    r1: bgpd has memory leaks:
    
    r2: zebra has memory leaks:
    
(1 more lines...)
test teardown failure
E   AssertionError: 
    r4: zebra has memory leaks:
    
    r4: bgpd has memory leaks:
    
    r1: zebra has memory leaks:
    
(9 more lines...)
test teardown failure
E   AssertionError: 
    r1: zebra has memory leaks:
    
    r1: bgpd has memory leaks:
AssertionError:  r1: zebra has memory leaks:  r1: bgpd has memory leaks:
E   AssertionError: 
    r1: zebra has memory leaks:
    
    r1: bgpd has memory leaks:
AssertionError:  r4: zebra has memory leaks:  r4: bgpd has memory leaks:
E   AssertionError: 
    r4: zebra has memory leaks:
    
    r4: bgpd has memory leaks:
test teardown failure
E   AssertionError: 
    r4: zebra has memory leaks:
    
    r4: bgpd has memory leaks:
    
    r1: zebra has memory leaks:
    
(9 more lines...)
test teardown failure
E   AssertionError: 
    r1: zebra has memory leaks:
    
    r1: bgpd has memory leaks:
    
    r2: zebra has memory leaks:
    
(1 more lines...)
AssertionError:  r1: zebra has memory leaks:  r1: bgpd has memory leaks:
E   AssertionError: 
    r1: zebra has memory leaks:
    
    r1: bgpd has memory leaks:
test teardown failure
E   AssertionError: 
    r4: zebra has memory leaks:
    
    r4: bgpd has memory leaks:
    
    r5: zebra has memory leaks:
    
(21 more lines...)
test teardown failure
E   AssertionError: 
    r4: zebra has memory leaks:
    
    r4: bgpd has memory leaks:
    
    r1: zebra has memory leaks:
    
(9 more lines...)
AssertionError:  r4: zebra has memory leaks:  r4: bgpd has memory leaks:
E   AssertionError: 
    r4: zebra has memory leaks:
    
    r4: bgpd has memory leaks:
AssertionError:  r4: zebra has memory leaks:  r4: bgpd has memory leaks:
E   AssertionError: 
    r4: zebra has memory leaks:
    
    r4: bgpd has memory leaks:
test teardown failure
E   AssertionError: 
    r1: zebra has memory leaks:
    
    r1: bgpd has memory leaks:
    
    r2: zebra has memory leaks:
    
(1 more lines...)
AssertionError:  r1: zebra has memory leaks:  r1: bgpd has memory leaks:
E   AssertionError: 
    r1: zebra has memory leaks:
    
    r1: bgpd has memory leaks:
test teardown failure
E   AssertionError: 
    r1: bgpd has memory leaks:
AssertionError:  r1: zebra has memory leaks:  r1: bgpd has memory leaks:
E   AssertionError: 
    r1: zebra has memory leaks:
    
    r1: bgpd has memory leaks:
AssertionError:  r1: zebra has memory leaks:
E   AssertionError: 
    r1: zebra has memory leaks:
test teardown failure
E   AssertionError: 
    r1: zebra has memory leaks:
    
    r1: bgpd has memory leaks:
    
    r2: zebra has memory leaks:
    
(5 more lines...)
test teardown failure
E   AssertionError: 
    r1: zebra has memory leaks:
    
    r1: bgpd has memory leaks:
    
    r2: zebra has memory leaks:
    
(5 more lines...)
test teardown failure
E   AssertionError: 
    r1: zebra has memory leaks:
    
    r1: bgpd has memory leaks:
    
    r2: zebra has memory leaks:
    
(5 more lines...)
AssertionError:  r4: zebra has memory leaks:
E   AssertionError: 
    r4: zebra has memory leaks:
AssertionError:  r1: zebra has memory leaks:
E   AssertionError: 
    r1: zebra has memory leaks:
AssertionError:  r1: zebra has memory leaks:
E   AssertionError: 
    r1: zebra has memory leaks:
AssertionError:  r2: zebra has memory leaks:
E   AssertionError: 
    r2: zebra has memory leaks:
AssertionError:  r1: zebra has memory leaks:
E   AssertionError: 
    r1: zebra has memory leaks:
AssertionError:  r4: zebra has memory leaks:
E   AssertionError: 
    r4: zebra has memory leaks:
AssertionError:  r4: zebra has memory leaks:
E   AssertionError: 
    r4: zebra has memory leaks:
AssertionError:  r1: zebra has memory leaks:
E   AssertionError: 
    r1: zebra has memory leaks:
AssertionError:  r1: zebra has memory leaks:
E   AssertionError: 
    r1: zebra has memory leaks:
AssertionError:  r1: zebra has memory leaks:
E   AssertionError: 
    r1: zebra has memory leaks:
AssertionError:  r1: zebra has memory leaks:
E   AssertionError: 
    r1: zebra has memory leaks: