Build #2,468

FreeRangeRouting Protocol Suite

Build result summary

Details

Completed
Duration
190 minutes
Labels
version=frr-7_1-dev-2308-gecb73a10egit=https_//github_com/frrouting/frr_gitbuildurl=https_//ci1_netdef_org/browse/frr-frr-2468branch=master
Revision
ecb73a10e7a9710914aef658d239f42538a881ab ecb73a10e7a9710914aef658d239f42538a881ab
Total tests
8812
Failing since
#2455 (Rebuilt by Martin Winter)
Fixed in
#2495 (Changes by Mark Stapp <mjs@voltanet.io>)

Responsible

Code commits

Author Commit Message Commit date
Sri Mohana Singamsetty <srimohans@gmail.com> Sri Mohana Singamsetty <srimohans@gmail.com> ecb73a10e7a9710914aef658d239f42538a881ab ecb73a10e7a9710914aef658d239f42538a881ab Merge pull request #4801 from donaldsharp/nht_vrf_show_evil
zebra: Allow v4 or v6 addresses to be optional after `vrf X` in show …
Sri Mohana Singamsetty <srimohans@gmail.com> Sri Mohana Singamsetty <srimohans@gmail.com> 5acb534dafc8d9d88440fa645b699cbea5ebe86d 5acb534dafc8d9d88440fa645b699cbea5ebe86d Merge pull request #4802 from donaldsharp/static_blackhole
staticd: Fix blackhole routes being installed
Donald Sharp Donald Sharp a6e85307c362b56a8431f3d44e14c97302ffe99d m a6e85307c362b56a8431f3d44e14c97302ffe99d staticd: Fix blackhole routes being installed
When we are ready to install a route, we were treating
blackhole routes as something that should be nexthop tracked
which does not work as well as one would expect.

Additionally add some test code to show that this actually
fixes this issue.

Signed-off-by: Donald Sharp <sharpd@cumulusnetworks.com>
Donald Sharp Donald Sharp 94a01fb26e4b8be71517b07d7920b594ef79b0a6 m 94a01fb26e4b8be71517b07d7920b594ef79b0a6 zebra: Allow v4 or v6 addresses to be optional after `vrf X` in show ip nht
The `show ip nht vrf EVA ...` command was not allowing you to only
specify the vrf anymore.  Fix this:

robot# show ip nht vrf EVA
  <cr>
  A.B.C.D   IPv4 Address
  X:X::X:X  IPv6 Address
robot# show ip nht vrf EVA 4.5.6.7
robot# show ip nht vrf EVA
robot#

Ticket: CM-25831
Signed-off-by: Donald Sharp <sharpd@cumulusnetworks.com>

Configuration changes

Plan configuration has changed since the last successful build. See the plan audit log for more details.

Tests

Existing test failures 37
Status Test Failing since View job Duration
AssertionError:  r1: zebra has memory leaks:  r1: bgpd has memory leaks:
E   AssertionError: 
    r1: zebra has memory leaks:
    
    r1: bgpd has memory leaks:
AssertionError:  r1: zebra has memory leaks:  r1: bgpd has memory leaks:
E   AssertionError: 
    r1: zebra has memory leaks:
    
    r1: bgpd has memory leaks:
AssertionError:  r4: zebra has memory leaks:  r4: bgpd has memory leaks:
E   AssertionError: 
    r4: zebra has memory leaks:
    
    r4: bgpd has memory leaks:
AssertionError:  r4: zebra has memory leaks:  r4: bgpd has memory leaks:
E   AssertionError: 
    r4: zebra has memory leaks:
    
    r4: bgpd has memory leaks:
AssertionError:  r4: zebra has memory leaks:  r4: bgpd has memory leaks:
E   AssertionError: 
    r4: zebra has memory leaks:
    
    r4: bgpd has memory leaks:
test teardown failure
E   AssertionError: 
    r4: zebra has memory leaks:
    
    r4: bgpd has memory leaks:
    
    r1: zebra has memory leaks:
    
(9 more lines...)
test teardown failure
E   AssertionError: 
    r1: zebra has memory leaks:
    
    r1: bgpd has memory leaks:
    
    r2: zebra has memory leaks:
    
(1 more lines...)
test teardown failure
E   AssertionError: 
    r4: zebra has memory leaks:
    
    r4: bgpd has memory leaks:
    
    r1: zebra has memory leaks:
    
(9 more lines...)
test teardown failure
E   AssertionError: 
    r1: zebra has memory leaks:
    
    r1: bgpd has memory leaks:
AssertionError:  r1: zebra has memory leaks:  r1: bgpd has memory leaks:
E   AssertionError: 
    r1: zebra has memory leaks:
    
    r1: bgpd has memory leaks:
AssertionError:  r4: zebra has memory leaks:  r4: bgpd has memory leaks:
E   AssertionError: 
    r4: zebra has memory leaks:
    
    r4: bgpd has memory leaks:
test teardown failure
E   AssertionError: 
    r4: zebra has memory leaks:
    
    r4: bgpd has memory leaks:
    
    r1: zebra has memory leaks:
    
(9 more lines...)
test teardown failure
E   AssertionError: 
    r1: zebra has memory leaks:
    
    r1: bgpd has memory leaks:
    
    r2: zebra has memory leaks:
    
(1 more lines...)
AssertionError:  r1: zebra has memory leaks:  r1: bgpd has memory leaks:
E   AssertionError: 
    r1: zebra has memory leaks:
    
    r1: bgpd has memory leaks:
test teardown failure
E   AssertionError: 
    r4: zebra has memory leaks:
    
    r4: bgpd has memory leaks:
    
    r5: zebra has memory leaks:
    
(21 more lines...)
test teardown failure
E   AssertionError: 
    r4: zebra has memory leaks:
    
    r4: bgpd has memory leaks:
    
    r1: zebra has memory leaks:
    
(9 more lines...)
AssertionError:  r4: zebra has memory leaks:  r4: bgpd has memory leaks:
E   AssertionError: 
    r4: zebra has memory leaks:
    
    r4: bgpd has memory leaks:
AssertionError:  r4: zebra has memory leaks:  r4: bgpd has memory leaks:
E   AssertionError: 
    r4: zebra has memory leaks:
    
    r4: bgpd has memory leaks:
test teardown failure
E   AssertionError: 
    r1: zebra has memory leaks:
    
    r1: bgpd has memory leaks:
    
    r2: zebra has memory leaks:
    
(1 more lines...)
AssertionError:  r1: zebra has memory leaks:  r1: bgpd has memory leaks:
E   AssertionError: 
    r1: zebra has memory leaks:
    
    r1: bgpd has memory leaks:
test teardown failure
E   AssertionError: 
    r1: zebra has memory leaks:
    
    r1: bgpd has memory leaks:
AssertionError:  r1: zebra has memory leaks:  r1: bgpd has memory leaks:
E   AssertionError: 
    r1: zebra has memory leaks:
    
    r1: bgpd has memory leaks:
AssertionError:  r1: zebra has memory leaks:
E   AssertionError: 
    r1: zebra has memory leaks:
test teardown failure
E   AssertionError: 
    r1: zebra has memory leaks:
    
    r1: bgpd has memory leaks:
    
    r2: zebra has memory leaks:
    
(5 more lines...)
test teardown failure
E   AssertionError: 
    r1: zebra has memory leaks:
    
    r1: bgpd has memory leaks:
    
    r2: zebra has memory leaks:
    
(5 more lines...)
test teardown failure
E   AssertionError: 
    r1: zebra has memory leaks:
    
    r1: bgpd has memory leaks:
    
    r2: zebra has memory leaks:
    
(5 more lines...)
AssertionError:  r4: zebra has memory leaks:
E   AssertionError: 
    r4: zebra has memory leaks:
AssertionError:  r1: zebra has memory leaks:
E   AssertionError: 
    r1: zebra has memory leaks:
AssertionError:  r1: zebra has memory leaks:
E   AssertionError: 
    r1: zebra has memory leaks:
AssertionError:  r2: zebra has memory leaks:
E   AssertionError: 
    r2: zebra has memory leaks:
AssertionError:  r1: zebra has memory leaks:
E   AssertionError: 
    r1: zebra has memory leaks:
AssertionError:  r4: zebra has memory leaks:
E   AssertionError: 
    r4: zebra has memory leaks:
AssertionError:  r4: zebra has memory leaks:
E   AssertionError: 
    r4: zebra has memory leaks:
AssertionError:  r1: zebra has memory leaks:
E   AssertionError: 
    r1: zebra has memory leaks:
AssertionError:  r1: zebra has memory leaks:
E   AssertionError: 
    r1: zebra has memory leaks:
AssertionError:  r1: zebra has memory leaks:
E   AssertionError: 
    r1: zebra has memory leaks:
AssertionError:  r1: zebra has memory leaks:
E   AssertionError: 
    r1: zebra has memory leaks: