Build #2,469

FreeRangeRouting Protocol Suite

Build: #2469 failed Changes by Donald Sharp and vdhingra <vdhingra@vmware.com>

Build result summary

Details

Completed
Duration
177 minutes
Labels
version=frr-7_1-dev-2310-g3e3178237git=https_//github_com/frrouting/frr_gitbuildurl=https_//ci1_netdef_org/browse/frr-frr-2469branch=master
Revision
3e31782374460a37f02bfa48dc7e48266c7cd238 3e31782374460a37f02bfa48dc7e48266c7cd238
Total tests
8812
Failing since
#2455 (Rebuilt by Martin Winter)
Fixed in
#2495 (Changes by Mark Stapp <mjs@voltanet.io>)

Responsible

Code commits

Author Commit Message Commit date
Donald Sharp Donald Sharp 3e31782374460a37f02bfa48dc7e48266c7cd238 3e31782374460a37f02bfa48dc7e48266c7cd238 Merge pull request #4828 from vishaldhingra/blackhole_type
zebra : blackhole_type was not set correctly in recursive routes
vdhingra <vdhingra@vmware.com> vdhingra <vdhingra@vmware.com> 2dc359a66e0f79fe778156fc8b712167d1be3c7e 2dc359a66e0f79fe778156fc8b712167d1be3c7e zebra : blackhole_type was not set correctly in recursive routes
If there is a recursive route resolved over blackhole route, then
the resolved blackhole_type is not getting set correctly.
This fix updates the bh_type correctly for resursive routes.

Signed-off-by: vishaldhingra <vdhingra@vmware.com>

Configuration changes

Plan configuration has changed since the last successful build. See the plan audit log for more details.

Tests

Existing test failures 37
Status Test Failing since View job Duration
AssertionError:  r1: zebra has memory leaks:  r1: bgpd has memory leaks:
E   AssertionError: 
    r1: zebra has memory leaks:
    
    r1: bgpd has memory leaks:
AssertionError:  r1: zebra has memory leaks:  r1: bgpd has memory leaks:
E   AssertionError: 
    r1: zebra has memory leaks:
    
    r1: bgpd has memory leaks:
AssertionError:  r4: zebra has memory leaks:  r4: bgpd has memory leaks:
E   AssertionError: 
    r4: zebra has memory leaks:
    
    r4: bgpd has memory leaks:
AssertionError:  r4: zebra has memory leaks:  r4: bgpd has memory leaks:
E   AssertionError: 
    r4: zebra has memory leaks:
    
    r4: bgpd has memory leaks:
AssertionError:  r4: zebra has memory leaks:  r4: bgpd has memory leaks:
E   AssertionError: 
    r4: zebra has memory leaks:
    
    r4: bgpd has memory leaks:
test teardown failure
E   AssertionError: 
    r4: zebra has memory leaks:
    
    r4: bgpd has memory leaks:
    
    r1: zebra has memory leaks:
    
(9 more lines...)
test teardown failure
E   AssertionError: 
    r1: zebra has memory leaks:
    
    r1: bgpd has memory leaks:
    
    r2: zebra has memory leaks:
    
(1 more lines...)
test teardown failure
E   AssertionError: 
    r4: zebra has memory leaks:
    
    r4: bgpd has memory leaks:
    
    r1: zebra has memory leaks:
    
(9 more lines...)
test teardown failure
E   AssertionError: 
    r1: zebra has memory leaks:
    
    r1: bgpd has memory leaks:
AssertionError:  r1: zebra has memory leaks:  r1: bgpd has memory leaks:
E   AssertionError: 
    r1: zebra has memory leaks:
    
    r1: bgpd has memory leaks:
AssertionError:  r4: zebra has memory leaks:  r4: bgpd has memory leaks:
E   AssertionError: 
    r4: zebra has memory leaks:
    
    r4: bgpd has memory leaks:
test teardown failure
E   AssertionError: 
    r4: zebra has memory leaks:
    
    r4: bgpd has memory leaks:
    
    r1: zebra has memory leaks:
    
(9 more lines...)
test teardown failure
E   AssertionError: 
    r1: zebra has memory leaks:
    
    r1: bgpd has memory leaks:
    
    r2: zebra has memory leaks:
    
(1 more lines...)
AssertionError:  r1: zebra has memory leaks:  r1: bgpd has memory leaks:
E   AssertionError: 
    r1: zebra has memory leaks:
    
    r1: bgpd has memory leaks:
test teardown failure
E   AssertionError: 
    r4: zebra has memory leaks:
    
    r4: bgpd has memory leaks:
    
    r5: zebra has memory leaks:
    
(21 more lines...)
test teardown failure
E   AssertionError: 
    r4: zebra has memory leaks:
    
    r4: bgpd has memory leaks:
    
    r1: zebra has memory leaks:
    
(9 more lines...)
AssertionError:  r4: zebra has memory leaks:  r4: bgpd has memory leaks:
E   AssertionError: 
    r4: zebra has memory leaks:
    
    r4: bgpd has memory leaks:
AssertionError:  r4: zebra has memory leaks:  r4: bgpd has memory leaks:
E   AssertionError: 
    r4: zebra has memory leaks:
    
    r4: bgpd has memory leaks:
test teardown failure
E   AssertionError: 
    r1: zebra has memory leaks:
    
    r1: bgpd has memory leaks:
    
    r2: zebra has memory leaks:
    
(1 more lines...)
AssertionError:  r1: zebra has memory leaks:  r1: bgpd has memory leaks:
E   AssertionError: 
    r1: zebra has memory leaks:
    
    r1: bgpd has memory leaks:
test teardown failure
E   AssertionError: 
    r1: bgpd has memory leaks:
AssertionError:  r1: zebra has memory leaks:  r1: bgpd has memory leaks:
E   AssertionError: 
    r1: zebra has memory leaks:
    
    r1: bgpd has memory leaks:
AssertionError:  r1: zebra has memory leaks:
E   AssertionError: 
    r1: zebra has memory leaks:
test teardown failure
E   AssertionError: 
    r1: zebra has memory leaks:
    
    r1: bgpd has memory leaks:
    
    r2: zebra has memory leaks:
    
(5 more lines...)
test teardown failure
E   AssertionError: 
    r1: zebra has memory leaks:
    
    r1: bgpd has memory leaks:
    
    r2: zebra has memory leaks:
    
(5 more lines...)
test teardown failure
E   AssertionError: 
    r1: zebra has memory leaks:
    
    r1: bgpd has memory leaks:
    
    r2: zebra has memory leaks:
    
(5 more lines...)
AssertionError:  r4: zebra has memory leaks:
E   AssertionError: 
    r4: zebra has memory leaks:
AssertionError:  r1: zebra has memory leaks:
E   AssertionError: 
    r1: zebra has memory leaks:
AssertionError:  r1: zebra has memory leaks:
E   AssertionError: 
    r1: zebra has memory leaks:
AssertionError:  r2: zebra has memory leaks:
E   AssertionError: 
    r2: zebra has memory leaks:
AssertionError:  r1: zebra has memory leaks:
E   AssertionError: 
    r1: zebra has memory leaks:
AssertionError:  r4: zebra has memory leaks:
E   AssertionError: 
    r4: zebra has memory leaks:
AssertionError:  r4: zebra has memory leaks:
E   AssertionError: 
    r4: zebra has memory leaks:
AssertionError:  r1: zebra has memory leaks:
E   AssertionError: 
    r1: zebra has memory leaks:
AssertionError:  r1: zebra has memory leaks:
E   AssertionError: 
    r1: zebra has memory leaks:
AssertionError:  r1: zebra has memory leaks:
E   AssertionError: 
    r1: zebra has memory leaks:
AssertionError:  r1: zebra has memory leaks:
E   AssertionError: 
    r1: zebra has memory leaks: