Build #2,540

FreeRangeRouting Protocol Suite

Build result summary

Details

Completed
Duration
191 minutes
Labels
version=frr-7_1-dev-2527-gba439635cgit=https_//github_com/frrouting/frr_gitbuildurl=https_//ci1_netdef_org/browse/frr-frr-2540branch=master
Revision
ba439635c68ba3fdaa773e4debc1bf65414f638d ba439635c68ba3fdaa773e4debc1bf65414f638d
Total tests
8937
Failing since
#2539 (Changes by Lou Berger)
Fixed in
#2542 (Changes by Donald Sharp and Mark Stapp <mjs@voltanet.io>)

Responsible

Code commits

Author Commit Message Commit date
Jafar Al-Gharaibeh <Jafaral@users.noreply.github.com> Jafar Al-Gharaibeh <Jafaral@users.noreply.github.com> ba439635c68ba3fdaa773e4debc1bf65414f638d ba439635c68ba3fdaa773e4debc1bf65414f638d Merge pull request #4958 from donaldsharp/pim_assert_a_saurus
pimd: Slightly loosen pim assert message length tests
Donald Sharp Donald Sharp f0ce8ac3e19d0c4e42323dde8d5db0d069ec99e2 m f0ce8ac3e19d0c4e42323dde8d5db0d069ec99e2 pimd: Slightly loosen pim assert message length tests
The Pim RFC does not appear to state any length requirements
of pim, other than the checksum must be correct.

Certain vendors are sending extra data at the end of a pim assert
message.  This while not explicitly against the rules was a bit
of surprise to pim when we threw the assert message on the floor
for being too long.

Modify the test to see if length left will allow us to read
the 8 bytes of data that we need.  If it is sufficient for
that allow the packet to be used.

Fixes: #4957
Signed-off-by: Donald Sharp <sharpd@cumulusnetworks.com>

Tests

New test failures 7
Status Test View job Duration
Collapse Failed test_ibgp_ecmp_topo2 test_ecmp_after_clear_bgp History
Topology Tests on Ubuntu 18.04 amd64 27 secs
AssertionError: Testcase test_ecmp_after_clear_bgp : Failed     Error: Nexthop ['fd00:0:0:1::1', 'fd00:0:0:2::1', 'fd00:0:0:3::1', 'fd00:0:0:4::1', 'fd00:0:0:5::1', 'fd00:0:0:6::1', 'fd00:0:0:7::1', 'fd00:0:0:8::1', 'fd00:0:0:9::1', 'fd00:0:0:a::1', 'fd00:0:0:b::1', 'fd00:0:0:c::1', 'fd00:0:0:d::1', 'fd00:0:0:e::1', 'fd00:0:0:f::1', 'fd00:0:0:10::1', 'fd00:0:0:11::1', 'fd00:0:0:12::1', 'fd00:0:0:13::1', 'fd00:0:0:14::1', 'fd00:0:0:15::1', 'fd00:0:0:16::1', 'fd00:0:0:17::1', 'fd00:0:0:18::1', 'fd00:0:0:19::1', 'fd00:0:0:1a::1', 'fd00:0:0:1b::1', 'fd00:0:0:1c::1', 'fd00:0:0:1d::1', 'fd00:0:0:1e::1', 'fd00:0:0:1f::1', 'fd00:0:0:20::1'] is Missing for bgp route 1::/64 in RIB of router r3    assert "Nexthop ['fd00:0:0:1::1', 'fd00:0:0:2::1', 'fd00:0:0:3::1', 'fd00:0:0:4::1', 'fd00:0:0:5::1', 'fd00:0:0:6::1', 'fd00:...:0:1d::1', 'fd00:0:0:1e::1', 'fd00:0:0:1f::1', 'fd00:0:0:20::1'] is Missing for bgp route 1::/64 in RIB of router r3\n" is True
E   AssertionError: Testcase test_ecmp_after_clear_bgp : Failed 
       Error: Nexthop ['fd00:0:0:1::1', 'fd00:0:0:2::1', 'fd00:0:0:3::1', 'fd00:0:0:4::1', 'fd00:0:0:5::1', 'fd00:0:0:6::1', 'fd00:0:0:7::1', 'fd00:0:0:8::1', 'fd00:0:0:9::1', 'fd00:0:0:a::1', 'fd00:0:0:b::1', 'fd00:0:0:c::1', 'fd00:0:0:d::1', 'fd00:0:0:e::1', 'fd00:0:0:f::1', 'fd00:0:0:10::1', 'fd00:0:0:11::1', 'fd00:0:0:12::1', 'fd00:0:0:13::1', 'fd00:0:0:14::1', 'fd00:0:0:15::1', 'fd00:0:0:16::1', 'fd00:0:0:17::1', 'fd00:0:0:18::1', 'fd00:0:0:19::1', 'fd00:0:0:1a::1', 'fd00:0:0:1b::1', 'fd00:0:0:1c::1', 'fd00:0:0:1d::1', 'fd00:0:0:1e::1', 'fd00:0:0:1f::1', 'fd00:0:0:20::1'] is Missing for bgp route 1::/64 in RIB of router r3
      
    assert "Nexthop ['fd00:0:0:1::1', 'fd00:0:0:2::1', 'fd00:0:0:3::1', 'fd00:0:0:4::1', 'fd00:0:0:5::1', 'fd00:0:0:6::1', 'fd00:...:0:1d::1', 'fd00:0:0:1e::1', 'fd00:0:0:1f::1', 'fd00:0:0:20::1'] is Missing for bgp route 1::/64 in RIB of router r3\n" is True
Collapse Failed test_ibgp_ecmp_topo2 test_ecmp_remove_static_route History
Topology Tests on Ubuntu 18.04 amd64 27 secs
AssertionError: Testcase test_ecmp_remove_static_route : Failed     Error: Nexthop ['fd00:0:0:1::1', 'fd00:0:0:2::1', 'fd00:0:0:3::1', 'fd00:0:0:4::1', 'fd00:0:0:5::1', 'fd00:0:0:6::1', 'fd00:0:0:7::1', 'fd00:0:0:8::1', 'fd00:0:0:9::1', 'fd00:0:0:a::1', 'fd00:0:0:b::1', 'fd00:0:0:c::1', 'fd00:0:0:d::1', 'fd00:0:0:e::1', 'fd00:0:0:f::1', 'fd00:0:0:10::1', 'fd00:0:0:11::1', 'fd00:0:0:12::1', 'fd00:0:0:13::1', 'fd00:0:0:14::1', 'fd00:0:0:15::1', 'fd00:0:0:16::1', 'fd00:0:0:17::1', 'fd00:0:0:18::1', 'fd00:0:0:19::1', 'fd00:0:0:1a::1', 'fd00:0:0:1b::1', 'fd00:0:0:1c::1', 'fd00:0:0:1d::1', 'fd00:0:0:1e::1', 'fd00:0:0:1f::1', 'fd00:0:0:20::1'] is Missing for bgp route 1::/64 in RIB of router r3    assert "Nexthop ['fd00:0:0:1::1', 'fd00:0:0:2::1', 'fd00:0:0:3::1', 'fd00:0:0:4::1', 'fd00:0:0:5::1', 'fd00:0:0:6::1', 'fd00:...:0:1d::1', 'fd00:0:0:1e::1', 'fd00:0:0:1f::1', 'fd00:0:0:20::1'] is Missing for bgp route 1::/64 in RIB of router r3\n" is True
E   AssertionError: Testcase test_ecmp_remove_static_route : Failed 
       Error: Nexthop ['fd00:0:0:1::1', 'fd00:0:0:2::1', 'fd00:0:0:3::1', 'fd00:0:0:4::1', 'fd00:0:0:5::1', 'fd00:0:0:6::1', 'fd00:0:0:7::1', 'fd00:0:0:8::1', 'fd00:0:0:9::1', 'fd00:0:0:a::1', 'fd00:0:0:b::1', 'fd00:0:0:c::1', 'fd00:0:0:d::1', 'fd00:0:0:e::1', 'fd00:0:0:f::1', 'fd00:0:0:10::1', 'fd00:0:0:11::1', 'fd00:0:0:12::1', 'fd00:0:0:13::1', 'fd00:0:0:14::1', 'fd00:0:0:15::1', 'fd00:0:0:16::1', 'fd00:0:0:17::1', 'fd00:0:0:18::1', 'fd00:0:0:19::1', 'fd00:0:0:1a::1', 'fd00:0:0:1b::1', 'fd00:0:0:1c::1', 'fd00:0:0:1d::1', 'fd00:0:0:1e::1', 'fd00:0:0:1f::1', 'fd00:0:0:20::1'] is Missing for bgp route 1::/64 in RIB of router r3
      
    assert "Nexthop ['fd00:0:0:1::1', 'fd00:0:0:2::1', 'fd00:0:0:3::1', 'fd00:0:0:4::1', 'fd00:0:0:5::1', 'fd00:0:0:6::1', 'fd00:...:0:1d::1', 'fd00:0:0:1e::1', 'fd00:0:0:1f::1', 'fd00:0:0:20::1'] is Missing for bgp route 1::/64 in RIB of router r3\n" is True
Collapse Failed test_ibgp_ecmp_topo2 test_ecmp_remove_redistribute_static History
Topology Tests on Ubuntu 18.04 amd64 27 secs
AssertionError: Testcase test_ecmp_remove_redistribute_static : Failed     Error: Nexthop ['fd00:0:0:1::1', 'fd00:0:0:2::1', 'fd00:0:0:3::1', 'fd00:0:0:4::1', 'fd00:0:0:5::1', 'fd00:0:0:6::1', 'fd00:0:0:7::1', 'fd00:0:0:8::1', 'fd00:0:0:9::1', 'fd00:0:0:a::1', 'fd00:0:0:b::1', 'fd00:0:0:c::1', 'fd00:0:0:d::1', 'fd00:0:0:e::1', 'fd00:0:0:f::1', 'fd00:0:0:10::1', 'fd00:0:0:11::1', 'fd00:0:0:12::1', 'fd00:0:0:13::1', 'fd00:0:0:14::1', 'fd00:0:0:15::1', 'fd00:0:0:16::1', 'fd00:0:0:17::1', 'fd00:0:0:18::1', 'fd00:0:0:19::1', 'fd00:0:0:1a::1', 'fd00:0:0:1b::1', 'fd00:0:0:1c::1', 'fd00:0:0:1d::1', 'fd00:0:0:1e::1', 'fd00:0:0:1f::1', 'fd00:0:0:20::1'] is Missing for bgp route 1::/64 in RIB of router r3    assert "Nexthop ['fd00:0:0:1::1', 'fd00:0:0:2::1', 'fd00:0:0:3::1', 'fd00:0:0:4::1', 'fd00:0:0:5::1', 'fd00:0:0:6::1', 'fd00:...:0:1d::1', 'fd00:0:0:1e::1', 'fd00:0:0:1f::1', 'fd00:0:0:20::1'] is Missing for bgp route 1::/64 in RIB of router r3\n" is True
E   AssertionError: Testcase test_ecmp_remove_redistribute_static : Failed 
       Error: Nexthop ['fd00:0:0:1::1', 'fd00:0:0:2::1', 'fd00:0:0:3::1', 'fd00:0:0:4::1', 'fd00:0:0:5::1', 'fd00:0:0:6::1', 'fd00:0:0:7::1', 'fd00:0:0:8::1', 'fd00:0:0:9::1', 'fd00:0:0:a::1', 'fd00:0:0:b::1', 'fd00:0:0:c::1', 'fd00:0:0:d::1', 'fd00:0:0:e::1', 'fd00:0:0:f::1', 'fd00:0:0:10::1', 'fd00:0:0:11::1', 'fd00:0:0:12::1', 'fd00:0:0:13::1', 'fd00:0:0:14::1', 'fd00:0:0:15::1', 'fd00:0:0:16::1', 'fd00:0:0:17::1', 'fd00:0:0:18::1', 'fd00:0:0:19::1', 'fd00:0:0:1a::1', 'fd00:0:0:1b::1', 'fd00:0:0:1c::1', 'fd00:0:0:1d::1', 'fd00:0:0:1e::1', 'fd00:0:0:1f::1', 'fd00:0:0:20::1'] is Missing for bgp route 1::/64 in RIB of router r3
      
    assert "Nexthop ['fd00:0:0:1::1', 'fd00:0:0:2::1', 'fd00:0:0:3::1', 'fd00:0:0:4::1', 'fd00:0:0:5::1', 'fd00:0:0:6::1', 'fd00:...:0:1d::1', 'fd00:0:0:1e::1', 'fd00:0:0:1f::1', 'fd00:0:0:20::1'] is Missing for bgp route 1::/64 in RIB of router r3\n" is True
Collapse Failed test_ibgp_ecmp_topo2 test_modify_ecmp_max_paths[advertise_nw-32] History
Topology Tests on Ubuntu 18.04 amd64 27 secs
AssertionError: Testcase test_modify_ecmp_max_paths[advertise_nw-32] : Failed     Error: Nexthop ['fd00:0:0:1::1', 'fd00:0:0:2::1', 'fd00:0:0:3::1', 'fd00:0:0:4::1', 'fd00:0:0:5::1', 'fd00:0:0:6::1', 'fd00:0:0:7::1', 'fd00:0:0:8::1', 'fd00:0:0:9::1', 'fd00:0:0:a::1', 'fd00:0:0:b::1', 'fd00:0:0:c::1', 'fd00:0:0:d::1', 'fd00:0:0:e::1', 'fd00:0:0:f::1', 'fd00:0:0:10::1', 'fd00:0:0:11::1', 'fd00:0:0:12::1', 'fd00:0:0:13::1', 'fd00:0:0:14::1', 'fd00:0:0:15::1', 'fd00:0:0:16::1', 'fd00:0:0:17::1', 'fd00:0:0:18::1', 'fd00:0:0:19::1', 'fd00:0:0:1a::1', 'fd00:0:0:1b::1', 'fd00:0:0:1c::1', 'fd00:0:0:1d::1', 'fd00:0:0:1e::1', 'fd00:0:0:1f::1', 'fd00:0:0:20::1'] is Missing for bgp route 1::/64 in RIB of router r3    assert "Nexthop ['fd00:0:0:1::1', 'fd00:0:0:2::1', 'fd00:0:0:3::1', 'fd00:0:0:4::1', 'fd00:0:0:5::1', 'fd00:0:0:6::1', 'fd00:...:0:1d::1', 'fd00:0:0:1e::1', 'fd00:0:0:1f::1', 'fd00:0:0:20::1'] is Missing for bgp route 1::/64 in RIB of router r3\n" is True
E   AssertionError: Testcase test_modify_ecmp_max_paths[advertise_nw-32] : Failed 
       Error: Nexthop ['fd00:0:0:1::1', 'fd00:0:0:2::1', 'fd00:0:0:3::1', 'fd00:0:0:4::1', 'fd00:0:0:5::1', 'fd00:0:0:6::1', 'fd00:0:0:7::1', 'fd00:0:0:8::1', 'fd00:0:0:9::1', 'fd00:0:0:a::1', 'fd00:0:0:b::1', 'fd00:0:0:c::1', 'fd00:0:0:d::1', 'fd00:0:0:e::1', 'fd00:0:0:f::1', 'fd00:0:0:10::1', 'fd00:0:0:11::1', 'fd00:0:0:12::1', 'fd00:0:0:13::1', 'fd00:0:0:14::1', 'fd00:0:0:15::1', 'fd00:0:0:16::1', 'fd00:0:0:17::1', 'fd00:0:0:18::1', 'fd00:0:0:19::1', 'fd00:0:0:1a::1', 'fd00:0:0:1b::1', 'fd00:0:0:1c::1', 'fd00:0:0:1d::1', 'fd00:0:0:1e::1', 'fd00:0:0:1f::1', 'fd00:0:0:20::1'] is Missing for bgp route 1::/64 in RIB of router r3
      
    assert "Nexthop ['fd00:0:0:1::1', 'fd00:0:0:2::1', 'fd00:0:0:3::1', 'fd00:0:0:4::1', 'fd00:0:0:5::1', 'fd00:0:0:6::1', 'fd00:...:0:1d::1', 'fd00:0:0:1e::1', 'fd00:0:0:1f::1', 'fd00:0:0:20::1'] is Missing for bgp route 1::/64 in RIB of router r3\n" is True
Collapse Failed test_ibgp_ecmp_topo2 test_modify_ecmp_max_paths[redist_static-32] History
Topology Tests on Ubuntu 18.04 amd64 27 secs
AssertionError: Testcase test_modify_ecmp_max_paths[redist_static-32] : Failed     Error: Nexthop ['fd00:0:0:1::1', 'fd00:0:0:2::1', 'fd00:0:0:3::1', 'fd00:0:0:4::1', 'fd00:0:0:5::1', 'fd00:0:0:6::1', 'fd00:0:0:7::1', 'fd00:0:0:8::1', 'fd00:0:0:9::1', 'fd00:0:0:a::1', 'fd00:0:0:b::1', 'fd00:0:0:c::1', 'fd00:0:0:d::1', 'fd00:0:0:e::1', 'fd00:0:0:f::1', 'fd00:0:0:10::1', 'fd00:0:0:11::1', 'fd00:0:0:12::1', 'fd00:0:0:13::1', 'fd00:0:0:14::1', 'fd00:0:0:15::1', 'fd00:0:0:16::1', 'fd00:0:0:17::1', 'fd00:0:0:18::1', 'fd00:0:0:19::1', 'fd00:0:0:1a::1', 'fd00:0:0:1b::1', 'fd00:0:0:1c::1', 'fd00:0:0:1d::1', 'fd00:0:0:1e::1', 'fd00:0:0:1f::1', 'fd00:0:0:20::1'] is Missing for bgp route 1::/64 in RIB of router r3    assert "Nexthop ['fd00:0:0:1::1', 'fd00:0:0:2::1', 'fd00:0:0:3::1', 'fd00:0:0:4::1', 'fd00:0:0:5::1', 'fd00:0:0:6::1', 'fd00:...:0:1d::1', 'fd00:0:0:1e::1', 'fd00:0:0:1f::1', 'fd00:0:0:20::1'] is Missing for bgp route 1::/64 in RIB of router r3\n" is True
E   AssertionError: Testcase test_modify_ecmp_max_paths[redist_static-32] : Failed 
       Error: Nexthop ['fd00:0:0:1::1', 'fd00:0:0:2::1', 'fd00:0:0:3::1', 'fd00:0:0:4::1', 'fd00:0:0:5::1', 'fd00:0:0:6::1', 'fd00:0:0:7::1', 'fd00:0:0:8::1', 'fd00:0:0:9::1', 'fd00:0:0:a::1', 'fd00:0:0:b::1', 'fd00:0:0:c::1', 'fd00:0:0:d::1', 'fd00:0:0:e::1', 'fd00:0:0:f::1', 'fd00:0:0:10::1', 'fd00:0:0:11::1', 'fd00:0:0:12::1', 'fd00:0:0:13::1', 'fd00:0:0:14::1', 'fd00:0:0:15::1', 'fd00:0:0:16::1', 'fd00:0:0:17::1', 'fd00:0:0:18::1', 'fd00:0:0:19::1', 'fd00:0:0:1a::1', 'fd00:0:0:1b::1', 'fd00:0:0:1c::1', 'fd00:0:0:1d::1', 'fd00:0:0:1e::1', 'fd00:0:0:1f::1', 'fd00:0:0:20::1'] is Missing for bgp route 1::/64 in RIB of router r3
      
    assert "Nexthop ['fd00:0:0:1::1', 'fd00:0:0:2::1', 'fd00:0:0:3::1', 'fd00:0:0:4::1', 'fd00:0:0:5::1', 'fd00:0:0:6::1', 'fd00:...:0:1d::1', 'fd00:0:0:1e::1', 'fd00:0:0:1f::1', 'fd00:0:0:20::1'] is Missing for bgp route 1::/64 in RIB of router r3\n" is True
Collapse Failed test_ibgp_ecmp_topo2 test_ecmp_remove_nw_advertise History
Topology Tests on Ubuntu 18.04 amd64 29 secs
AssertionError: Testcase test_ecmp_remove_nw_advertise : Failed     Error: Nexthop ['fd00:0:0:1::1', 'fd00:0:0:2::1', 'fd00:0:0:3::1', 'fd00:0:0:4::1', 'fd00:0:0:5::1', 'fd00:0:0:6::1', 'fd00:0:0:7::1', 'fd00:0:0:8::1', 'fd00:0:0:9::1', 'fd00:0:0:a::1', 'fd00:0:0:b::1', 'fd00:0:0:c::1', 'fd00:0:0:d::1', 'fd00:0:0:e::1', 'fd00:0:0:f::1', 'fd00:0:0:10::1', 'fd00:0:0:11::1', 'fd00:0:0:12::1', 'fd00:0:0:13::1', 'fd00:0:0:14::1', 'fd00:0:0:15::1', 'fd00:0:0:16::1', 'fd00:0:0:17::1', 'fd00:0:0:18::1', 'fd00:0:0:19::1', 'fd00:0:0:1a::1', 'fd00:0:0:1b::1', 'fd00:0:0:1c::1', 'fd00:0:0:1d::1', 'fd00:0:0:1e::1', 'fd00:0:0:1f::1', 'fd00:0:0:20::1'] is Missing for bgp route 1::/64 in RIB of router r3    assert "Nexthop ['fd00:0:0:1::1', 'fd00:0:0:2::1', 'fd00:0:0:3::1', 'fd00:0:0:4::1', 'fd00:0:0:5::1', 'fd00:0:0:6::1', 'fd00:...:0:1d::1', 'fd00:0:0:1e::1', 'fd00:0:0:1f::1', 'fd00:0:0:20::1'] is Missing for bgp route 1::/64 in RIB of router r3\n" is True
E   AssertionError: Testcase test_ecmp_remove_nw_advertise : Failed 
       Error: Nexthop ['fd00:0:0:1::1', 'fd00:0:0:2::1', 'fd00:0:0:3::1', 'fd00:0:0:4::1', 'fd00:0:0:5::1', 'fd00:0:0:6::1', 'fd00:0:0:7::1', 'fd00:0:0:8::1', 'fd00:0:0:9::1', 'fd00:0:0:a::1', 'fd00:0:0:b::1', 'fd00:0:0:c::1', 'fd00:0:0:d::1', 'fd00:0:0:e::1', 'fd00:0:0:f::1', 'fd00:0:0:10::1', 'fd00:0:0:11::1', 'fd00:0:0:12::1', 'fd00:0:0:13::1', 'fd00:0:0:14::1', 'fd00:0:0:15::1', 'fd00:0:0:16::1', 'fd00:0:0:17::1', 'fd00:0:0:18::1', 'fd00:0:0:19::1', 'fd00:0:0:1a::1', 'fd00:0:0:1b::1', 'fd00:0:0:1c::1', 'fd00:0:0:1d::1', 'fd00:0:0:1e::1', 'fd00:0:0:1f::1', 'fd00:0:0:20::1'] is Missing for bgp route 1::/64 in RIB of router r3
      
    assert "Nexthop ['fd00:0:0:1::1', 'fd00:0:0:2::1', 'fd00:0:0:3::1', 'fd00:0:0:4::1', 'fd00:0:0:5::1', 'fd00:0:0:6::1', 'fd00:...:0:1d::1', 'fd00:0:0:1e::1', 'fd00:0:0:1f::1', 'fd00:0:0:20::1'] is Missing for bgp route 1::/64 in RIB of router r3\n" is True
Collapse Failed test_ibgp_ecmp_topo2 test_ecmp_shut_bgp_neighbor History
Topology Tests on Ubuntu 18.04 amd64 27 secs
AssertionError: Testcase test_ecmp_shut_bgp_neighbor : Failed     Error: Nexthop ['fd00:0:0:1::1', 'fd00:0:0:2::1', 'fd00:0:0:3::1', 'fd00:0:0:4::1', 'fd00:0:0:5::1', 'fd00:0:0:6::1', 'fd00:0:0:7::1', 'fd00:0:0:8::1', 'fd00:0:0:9::1', 'fd00:0:0:a::1', 'fd00:0:0:b::1', 'fd00:0:0:c::1', 'fd00:0:0:d::1', 'fd00:0:0:e::1', 'fd00:0:0:f::1', 'fd00:0:0:10::1', 'fd00:0:0:11::1', 'fd00:0:0:12::1', 'fd00:0:0:13::1', 'fd00:0:0:14::1', 'fd00:0:0:15::1', 'fd00:0:0:16::1', 'fd00:0:0:17::1', 'fd00:0:0:18::1', 'fd00:0:0:19::1', 'fd00:0:0:1a::1', 'fd00:0:0:1b::1', 'fd00:0:0:1c::1', 'fd00:0:0:1d::1', 'fd00:0:0:1e::1', 'fd00:0:0:1f::1', 'fd00:0:0:20::1'] is Missing for bgp route 1::/64 in RIB of router r3    assert "Nexthop ['fd00:0:0:1::1', 'fd00:0:0:2::1', 'fd00:0:0:3::1', 'fd00:0:0:4::1', 'fd00:0:0:5::1', 'fd00:0:0:6::1', 'fd00:...:0:1d::1', 'fd00:0:0:1e::1', 'fd00:0:0:1f::1', 'fd00:0:0:20::1'] is Missing for bgp route 1::/64 in RIB of router r3\n" is True
E   AssertionError: Testcase test_ecmp_shut_bgp_neighbor : Failed 
       Error: Nexthop ['fd00:0:0:1::1', 'fd00:0:0:2::1', 'fd00:0:0:3::1', 'fd00:0:0:4::1', 'fd00:0:0:5::1', 'fd00:0:0:6::1', 'fd00:0:0:7::1', 'fd00:0:0:8::1', 'fd00:0:0:9::1', 'fd00:0:0:a::1', 'fd00:0:0:b::1', 'fd00:0:0:c::1', 'fd00:0:0:d::1', 'fd00:0:0:e::1', 'fd00:0:0:f::1', 'fd00:0:0:10::1', 'fd00:0:0:11::1', 'fd00:0:0:12::1', 'fd00:0:0:13::1', 'fd00:0:0:14::1', 'fd00:0:0:15::1', 'fd00:0:0:16::1', 'fd00:0:0:17::1', 'fd00:0:0:18::1', 'fd00:0:0:19::1', 'fd00:0:0:1a::1', 'fd00:0:0:1b::1', 'fd00:0:0:1c::1', 'fd00:0:0:1d::1', 'fd00:0:0:1e::1', 'fd00:0:0:1f::1', 'fd00:0:0:20::1'] is Missing for bgp route 1::/64 in RIB of router r3
      
    assert "Nexthop ['fd00:0:0:1::1', 'fd00:0:0:2::1', 'fd00:0:0:3::1', 'fd00:0:0:4::1', 'fd00:0:0:5::1', 'fd00:0:0:6::1', 'fd00:...:0:1d::1', 'fd00:0:0:1e::1', 'fd00:0:0:1f::1', 'fd00:0:0:20::1'] is Missing for bgp route 1::/64 in RIB of router r3\n" is True
Existing test failures 4
Status Test Failing since View job Duration
KeyError: 'IPv4 Unicast'
E   KeyError: 'IPv4 Unicast'
KeyError: 'IPv4 Unicast'
E   KeyError: 'IPv4 Unicast'
KeyError: 'IPv4 Unicast'
E   KeyError: 'IPv4 Unicast'
KeyError: 'IPv4 Unicast'
E   KeyError: 'IPv4 Unicast'