Build #3,447

FreeRangeRouting Protocol Suite

Build result summary

Details

Completed
Duration
146 minutes
Labels
version=frr-7_4-dev-1805-g87b42ba8cgit=https_//github_com/frrouting/frr_gitbuildurl=https_//ci1_netdef_org/browse/frr-frr-3447branch=master
Revision
87b42ba8c39aede02817b2e490620ceb924265ac 87b42ba8c39aede02817b2e490620ceb924265ac
Total tests
9711
Failing since
#3431 (Manual run by Martin Winter)
Fixed in
#3448 (Changes by Donald Sharp and Mark Stapp <mjs@voltanet.io>)

Responsible

This build has been failing since #3431
No one has taken responsibility

Code commits

Author Commit Message Commit date
Donatas Abraitis <donatas.abraitis@gmail.com> Donatas Abraitis <donatas.abraitis@gmail.com> 87b42ba8c39aede02817b2e490620ceb924265ac 87b42ba8c39aede02817b2e490620ceb924265ac Merge pull request #6645 from pguibert6WIND/maxpathlunicast
bgpd: add maximum-paths vty command to ipv6 lu node
Philippe Guibert Philippe Guibert 39edabac9726bc8438c8c23c64729f339e176243 m 39edabac9726bc8438c8c23c64729f339e176243 bgpd: add maximum-paths vty command to ipv4 lu node
add maximum-paths vty command to ipv4 lu node.

Signed-off-by: Philippe Guibert <philippe.guibert@6wind.com>

Tests

New test failures 1
Status Test View job Duration
Collapse Failed test_isis_sr_topo1 test_memory_leak History
TopoTests Ubuntu 18.04 amd64 Part 0 6 secs
AssertionError:  rt5: zebra crashed. Core file found - Backtrace follows: [New LWP 18841] [New LWP 18843] [New LWP 18844] [New LWP 18842] [Thread debugging using libthread_db enabled] Using host libthread_db library "/lib/x86_64-linux-gnu/libthread_db.so.1". Core was generated by `/usr/lib/frr/zebra'. Program terminated with signal SIGABRT, Aborted. #0  __GI_raise (sig=sig@entry=6) at ../sysdeps/unix/sysv/linux/raise.c:51 [Current thread is 1 (Thread 0x7f815edc17c0 (LWP 18841))] #0  __GI_raise (sig=sig@entry=6) at ../sysdeps/unix/sysv/linux/raise.c:51 #1  0x00007f815dfa4801 in __GI_abort () at abort.c:79 #2  0x00007f815ea00e0f in ?? () from /usr/lib/x86_64-linux-gnu/frr/libfrr.so.0 #3  <signal handler called> #4  0x00007f815e078bf9 in __GI___poll (fds=0x55eec78dce20, nfds=6, timeout=-1) at ../sysdeps/unix/sysv/linux/poll.c:29 #5  0x00007f815ea0ebc0 in thread_fetch () from /usr/lib/x86_64-linux-gnu/frr/libfrr.so.0 #6  0x00007f815e9d8df3 in frr_run () from /usr/lib/x86_64-linux-gnu/frr/libfrr.so.0 #7  0x000055eec560ff88 in main ()
E   AssertionError: 
    rt5: zebra crashed. Core file found - Backtrace follows:
    [New LWP 18841]
    [New LWP 18843]
    [New LWP 18844]
    [New LWP 18842]
    [Thread debugging using libthread_db enabled]
(13 more lines...)
Existing test failures 1
Status Test Failing since View job Duration
AssertionError: "show pbr map" mismatches on r1 assert Generated JSON diff error report:      > $: d2 has the following element at index 0 which is not present in d1:        {        "valid": false,        "name": "AKIHABARA",        "policies": [            {                "sequenceNumber": 5,                "installedReason": "Valid",                "installed": true,                "nexthopGroup": {                    "installedInternally": 1,                    "name": "C",                    "installed": true                },                "matchDst": "192.168.4.0/24",                "vrfUnchanged": false            },            {                "nexthopGroup": {                    "installedInternally": 1,                    "name": "C",                    "installed": true                },                "installed": true,                "installedReason": "Invalid Src or Dst",                "sequenceNumber": 10,                "vrfUnchanged": false            },            {                "vrfUnchanged": false,                "installedReason": "No Nexthops",                "sequenceNumber": 15,                "installed": false            }        ]    }       Closest match in d1 is at index 0 with the following errors:        > $[0]->policies: d2 has the following element at index 0 which is not present in d1:          {         "sequenceNumber": 5,         "installedReason": "Valid",         "installed": true,         "nexthopGroup": {             "installedInternally": 1,             "name": "C",             "installed": true         },         "matchDst": "192.168.4.0/24",         "vrfUnchanged": false     }         Closest match in d1 is at index 0 with the following errors:          > $[0]->policies[0]->installedReason: d1 has element with value 'Invalid NH-group' but in d2 it has value 'Valid'     > $[0]->policies[0]->installed: d1 has element with value 'False' but in d2 it has value 'True'     > $[0]->policies[0]->nexthopGroup->installedInternally: d1 has element with value '0' but in d2 it has value '1'     > $[0]->policies[0]->nexthopGroup->installed: d1 has element with value 'False' but in d2 it has value 'True'        > $[0]->policies: d2 has the following element at index 1 which is not present in d1:          {         "vrfUnchanged": false,         "nexthopGroup": {             "installedInternally": 1,             "name": "C",             "installed": true         },         "installedReason": "Invalid Src or Dst",         "sequenceNumber": 10,         "installed": true     }         Closest match in d1 is at index 1 with the following errors:          > $[0]->policies[1]->installed: d1 has element with value 'False' but in d2 it has value 'True'     > $[0]->policies[1]->installedReason: d1 has element with value 'Invalid NH-group, Invalid Src or Dst' but in d2 it has value 'Invalid Src or Dst'     > $[0]->policies[1]->nexthopGroup->installedInternally: d1 has element with value '0' but in d2 it has value '1'     > $[0]->policies[1]->nexthopGroup->installed: d1 has element with value 'False' but in d2 it has value 'True'
E   AssertionError: "show pbr map" mismatches on r1
    assert Generated JSON diff error report:
      
      > $: d2 has the following element at index 0 which is not present in d1: 
      
      	{
      	    "valid": false,
(78 more lines...)