Build #3,492

FreeRangeRouting Protocol Suite

Build: #3492 failed Changes by Quentin Young

Build result summary

Details

Completed
Duration
145 minutes
Labels
version=frr-7_4-dev-1936-gb86e8befcgit=https_//github_com/frrouting/frr_gitbuildurl=https_//ci1_netdef_org/browse/frr-frr-3492branch=master
Revision
b86e8befc77b8fd95412fad6dfa9ed9d9e3d4858 b86e8befc77b8fd95412fad6dfa9ed9d9e3d4858
Total tests
9767
Failing since
#3465 (Changes by Quentin Young)
Fixed in
#3496 (Changes by Quentin Young)

Responsible

Code commits

Author Commit Message Commit date
Quentin Young Quentin Young b86e8befc77b8fd95412fad6dfa9ed9d9e3d4858 b86e8befc77b8fd95412fad6dfa9ed9d9e3d4858 Merge pull request #6718 from opensourcerouting/bfd-profile-small-fix
bfdd: update detect multiplier on profile change
Rafael Zalamena Rafael Zalamena 2975f578defea6467bea12eb03e837a484032905 m 2975f578defea6467bea12eb03e837a484032905 bfdd: update detect multiplier on profile change
Add missing profile update hook for detection multiplier change.

Signed-off-by: Rafael Zalamena <rzalamena@opensourcerouting.org>

Tests

New test failures 14
Status Test View job Duration
Collapse Failed test_ibgp_ecmp_topo2 test_ecmp_remove_redistribute_static History
TopoTests Ubuntu 16.04 amd64 Part 1 < 1 sec
test setup failure
E   AssertionError: setup_module :Failed 
       Error: [DUT: r2] VRF: default, BGP is not converged
    assert '[DUT: r2] VRF: default, BGP is not converged' is True
Collapse Failed test_ibgp_ecmp_topo2 test_ecmp_shut_bgp_neighbor[redist_static] History
TopoTests Ubuntu 16.04 amd64 Part 1 < 1 sec
test setup failure
E   AssertionError: setup_module :Failed 
       Error: [DUT: r2] VRF: default, BGP is not converged
    assert '[DUT: r2] VRF: default, BGP is not converged' is True
Collapse Failed test_ibgp_ecmp_topo2 test_ecmp_remove_nw_advertise History
TopoTests Ubuntu 16.04 amd64 Part 1 < 1 sec
test setup failure
E   AssertionError: setup_module :Failed 
       Error: [DUT: r2] VRF: default, BGP is not converged
    assert '[DUT: r2] VRF: default, BGP is not converged' is True
Collapse Failed test_ibgp_ecmp_topo2 test_modify_ecmp_max_paths[redist_static-16] History
TopoTests Ubuntu 16.04 amd64 Part 1 < 1 sec
test setup failure
E   AssertionError: setup_module :Failed 
       Error: [DUT: r2] VRF: default, BGP is not converged
    assert '[DUT: r2] VRF: default, BGP is not converged' is True
Collapse Failed test_ibgp_ecmp_topo2 test_modify_ecmp_max_paths[redist_static-32] History
TopoTests Ubuntu 16.04 amd64 Part 1 < 1 sec
test setup failure
E   AssertionError: setup_module :Failed 
       Error: [DUT: r2] VRF: default, BGP is not converged
    assert '[DUT: r2] VRF: default, BGP is not converged' is True
Collapse Failed test_ibgp_ecmp_topo2 test_modify_ecmp_max_paths[redist_static-8] History
TopoTests Ubuntu 16.04 amd64 Part 1 2 mins
test setup failure
E   AssertionError: setup_module :Failed 
       Error: [DUT: r2] VRF: default, BGP is not converged
    assert '[DUT: r2] VRF: default, BGP is not converged' is True
Collapse Failed test_ibgp_ecmp_topo2 test_ecmp_after_clear_bgp[redist_static] History
TopoTests Ubuntu 16.04 amd64 Part 1 < 1 sec
test setup failure
E   AssertionError: setup_module :Failed 
       Error: [DUT: r2] VRF: default, BGP is not converged
    assert '[DUT: r2] VRF: default, BGP is not converged' is True
Collapse Failed test_ibgp_ecmp_topo2 test_modify_ecmp_max_paths[advertise_nw-16] History
TopoTests Ubuntu 16.04 amd64 Part 1 < 1 sec
test setup failure
E   AssertionError: setup_module :Failed 
       Error: [DUT: r2] VRF: default, BGP is not converged
    assert '[DUT: r2] VRF: default, BGP is not converged' is True
Collapse Failed test_ibgp_ecmp_topo2 test_modify_ecmp_max_paths[advertise_nw-32] History
TopoTests Ubuntu 16.04 amd64 Part 1 < 1 sec
test setup failure
E   AssertionError: setup_module :Failed 
       Error: [DUT: r2] VRF: default, BGP is not converged
    assert '[DUT: r2] VRF: default, BGP is not converged' is True
Collapse Failed test_ibgp_ecmp_topo2 test_ecmp_shut_bgp_neighbor[advertise_nw] History
TopoTests Ubuntu 16.04 amd64 Part 1 < 1 sec
test setup failure
E   AssertionError: setup_module :Failed 
       Error: [DUT: r2] VRF: default, BGP is not converged
    assert '[DUT: r2] VRF: default, BGP is not converged' is True
Collapse Failed test_ibgp_ecmp_topo2 test_ecmp_remove_static_route History
TopoTests Ubuntu 16.04 amd64 Part 1 < 1 sec
test setup failure
E   AssertionError: setup_module :Failed 
       Error: [DUT: r2] VRF: default, BGP is not converged
    assert '[DUT: r2] VRF: default, BGP is not converged' is True
Collapse Failed test_ibgp_ecmp_topo2 test_ecmp_after_clear_bgp[advertise_nw] History
TopoTests Ubuntu 16.04 amd64 Part 1 < 1 sec
test setup failure
E   AssertionError: setup_module :Failed 
       Error: [DUT: r2] VRF: default, BGP is not converged
    assert '[DUT: r2] VRF: default, BGP is not converged' is True
Collapse Failed test_ibgp_ecmp_topo2 test_modify_ecmp_max_paths[advertise_nw-8] History
TopoTests Ubuntu 16.04 amd64 Part 1 < 1 sec
test setup failure
E   AssertionError: setup_module :Failed 
       Error: [DUT: r2] VRF: default, BGP is not converged
    assert '[DUT: r2] VRF: default, BGP is not converged' is True
Collapse Failed test_bgp_rr_ibgp_topo1 test_shutdown_check_stderr History
TopoTests Ubuntu 16.04 arm8 Part 2 15 secs
AssertionError:  tor1: zebra crashed. Core file found - Backtrace follows: [New LWP 20630] [New LWP 20631] [New LWP 20633] [New LWP 20632] [Thread debugging using libthread_db enabled] Using host libthread_db library "/lib/aarch64-linux-gnu/libthread_db.so.1". Core was generated by `/usr/lib/frr/zebra --log stdout --log-level debug -d'. Program terminated with signal SIGABRT, Aborted. #0  0x0000ffff929db528 in __GI_raise (sig=sig@entry=6) at ../sysdeps/unix/sysv/linux/raise.c:54 [Current thread is 1 (Thread 0xffff92570000 (LWP 20630))] #0  0x0000ffff929db528 in __GI_raise (sig=sig@entry=6) at ../sysdeps/unix/sysv/linux/raise.c:54 #1  0x0000ffff929dc9e0 in __GI_abort () at abort.c:89 #2  0x0000ffff92bb1e30 in ?? () from /usr/lib/aarch64-linux-gnu/frr/libfrr.so.0 #3  <signal handler called> #4  0x0000ffff92a68034 in __GI___poll (fds=0xaaaaffc23120, nfds=6, timeout=<optimized out>) at ../sysdeps/unix/sysv/linux/generic/poll.c:38 #5  0x0000ffff92bc01f0 in thread_fetch () from /usr/lib/aarch64-linux-gnu/frr/libfrr.so.0 #6  0x0000ffff92b88c8c in frr_run () from /usr/lib/aarch64-linux-gnu/frr/libfrr.so.0 #7  0x0000aaaad2b2b660 in main ()
E   AssertionError: 
    tor1: zebra crashed. Core file found - Backtrace follows:
    [New LWP 20630]
    [New LWP 20631]
    [New LWP 20633]
    [New LWP 20632]
    [Thread debugging using libthread_db enabled]
(13 more lines...)
Existing test failures 1
Status Test Failing since View job Duration
AssertionError: Testcase test_BGP_peering_bw_loopback_and_physical_p1 : Failed     Error : [DUT: r1] VRF: default, BGP is not converged for peer: fd00:0:0:1::2 assert '[DUT: r1] VRF: default, BGP is not converged for peer: fd00:0:0:1::2' is True
E   AssertionError: Testcase test_BGP_peering_bw_loopback_and_physical_p1 : Failed 
       Error : [DUT: r1] VRF: default, BGP is not converged for peer: fd00:0:0:1::2
    assert '[DUT: r1] VRF: default, BGP is not converged for peer: fd00:0:0:1::2' is True
Fixed tests 26
Status Test Failing since View job Duration
Successful test_bgp_multi_vrf_topo1 test_ambiguous_overlapping_addresses_in_different_vrfs_p0 History
Failing since build #3490 (Changes by Rafael Zalamena <rzalamena@users.noreply.github.com>) TopoTests Ubuntu 16.04 arm8 Part 2 50 secs
Successful test_bgp_multi_vrf_topo1 test_static_routes_advertised_within_specific_vrf_p0 History
Failing since build #3490 (Changes by Rafael Zalamena <rzalamena@users.noreply.github.com>) TopoTests Ubuntu 16.04 arm8 Part 2 1 min
Successful test_bgp_multi_vrf_topo1 test_route_map_set_and_match_metric_p0 History
Failing since build #3490 (Changes by Rafael Zalamena <rzalamena@users.noreply.github.com>) TopoTests Ubuntu 16.04 arm8 Part 2 43 secs
Successful test_bgp_multi_vrf_topo1 test_route_map_within_vrf_to_alter_bgp_attribute_p0[weight] History
Failing since build #3490 (Changes by Rafael Zalamena <rzalamena@users.noreply.github.com>) TopoTests Ubuntu 16.04 arm8 Part 2 1 min
Successful test_bgp_multi_vrf_topo1 test_inter_vrf_and_intra_vrf_communication_eBGP_p0 History
Failing since build #3490 (Changes by Rafael Zalamena <rzalamena@users.noreply.github.com>) TopoTests Ubuntu 16.04 arm8 Part 2 35 secs
Successful test_bgp_multi_vrf_topo1 test_route_map_within_vrf_to_alter_bgp_attribute_nexthop_p0 History
Failing since build #3490 (Changes by Rafael Zalamena <rzalamena@users.noreply.github.com>) TopoTests Ubuntu 16.04 arm8 Part 2 1 min
Successful test_bgp_multi_vrf_topo1 test_route_map_set_and_match_tag_p0 History
Failing since build #3490 (Changes by Rafael Zalamena <rzalamena@users.noreply.github.com>) TopoTests Ubuntu 16.04 arm8 Part 2 44 secs
Successful test_bgp_multi_vrf_topo1 test_route_map_within_vrf_to_alter_bgp_attribute_aspath_p0 History
Failing since build #3490 (Changes by Rafael Zalamena <rzalamena@users.noreply.github.com>) TopoTests Ubuntu 16.04 arm8 Part 2 1 min
Successful test_bgp_multi_vrf_topo1 test_route_map_set_and_match_community_p0 History
Failing since build #3490 (Changes by Rafael Zalamena <rzalamena@users.noreply.github.com>) TopoTests Ubuntu 16.04 arm8 Part 2 1 min
Successful test_bgp_multi_vrf_topo1 test_route_map_within_vrf_to_alter_bgp_attribute_p0[locPrf] History
Failing since build #3490 (Changes by Rafael Zalamena <rzalamena@users.noreply.github.com>) TopoTests Ubuntu 16.04 arm8 Part 2 1 min
Successful test_bgp_multi_vrf_topo1 test_vrf_with_unique_physical_interface_p0 History
Failing since build #3490 (Changes by Rafael Zalamena <rzalamena@users.noreply.github.com>) TopoTests Ubuntu 16.04 arm8 Part 2 44 secs
Successful test_bgp_multi_vrf_topo1 test_route_map_within_vrf_to_alter_bgp_attribute_p0[metric] History
Failing since build #3490 (Changes by Rafael Zalamena <rzalamena@users.noreply.github.com>) TopoTests Ubuntu 16.04 arm8 Part 2 1 min
Successful test_bgp_multi_vrf_topo1 test_route_map_within_vrf_to_alter_bgp_attribute_lcomm_p0 History
Failing since build #3490 (Changes by Rafael Zalamena <rzalamena@users.noreply.github.com>) TopoTests Ubuntu 16.04 arm8 Part 2 1 min
Successful test_bgp_multi_vrf_topo1 test_end_to_end_traffic_isolation_p0 History
Failing since build #3490 (Changes by Rafael Zalamena <rzalamena@users.noreply.github.com>) TopoTests Ubuntu 16.04 arm8 Part 2 2 mins
Successful test_bgp_multi_vrf_topo1 test_static_routes_for_inter_vrf_route_leaking_p0 History
Failing since build #3490 (Changes by Rafael Zalamena <rzalamena@users.noreply.github.com>) TopoTests Ubuntu 16.04 arm8 Part 2 34 secs
Successful test_bgp_multi_vrf_topo1 test_address_unambiguous_within_each_vrf_p0 History
Failing since build #3490 (Changes by Rafael Zalamena <rzalamena@users.noreply.github.com>) TopoTests Ubuntu 16.04 arm8 Part 2 54 secs
Successful test_bgp_multi_vrf_topo1 test_prefixes_leaking_p0 History
Failing since build #3490 (Changes by Rafael Zalamena <rzalamena@users.noreply.github.com>) TopoTests Ubuntu 16.04 arm8 Part 2 57 secs
Successful test_bgp_multi_vrf_topo1 test_static_routes_associated_to_specific_vrfs_p0 History
Failing since build #3490 (Changes by Rafael Zalamena <rzalamena@users.noreply.github.com>) TopoTests Ubuntu 16.04 arm8 Part 2 51 secs
Successful test_bgp_multi_vrf_topo1 test_inter_vrf_and_intra_vrf_communication_iBGP_p0 History
Failing since build #3490 (Changes by Rafael Zalamena <rzalamena@users.noreply.github.com>) TopoTests Ubuntu 16.04 arm8 Part 2 35 secs
Successful test_bgp_multi_vrf_topo1 test_route_map_match_traffic_based_on_vrf_p0 History
Failing since build #3490 (Changes by Rafael Zalamena <rzalamena@users.noreply.github.com>) TopoTests Ubuntu 16.04 arm8 Part 2 41 secs
Successful test_bgp_multi_vrf_topo1 test_vrf_lite_with_static_bgp_originated_routes_p0 History
Failing since build #3490 (Changes by Rafael Zalamena <rzalamena@users.noreply.github.com>) TopoTests Ubuntu 16.04 arm8 Part 2 1 min
Successful test_bgp_multi_vrf_topo1 test_prefix_list_to_permit_deny_prefixes_p0 History
Failing since build #3490 (Changes by Rafael Zalamena <rzalamena@users.noreply.github.com>) TopoTests Ubuntu 16.04 arm8 Part 2 1 min
Successful test_bgp_multi_vrf_topo2 test_vrf_route_leaking_next_hop_interface_flapping_p1 History
Failing since build #3490 (Changes by Rafael Zalamena <rzalamena@users.noreply.github.com>) TopoTests Ubuntu 16.04 arm8 Part 2 58 secs
Successful test_bgp_multi_vrf_topo2 test_shut_noshut_p1 History
Failing since build #3490 (Changes by Rafael Zalamena <rzalamena@users.noreply.github.com>) TopoTests Ubuntu 16.04 arm8 Part 2 2 mins
Successful test_bgp_multi_vrf_topo2 test_vrf_vlan_routing_table_p1 History
Failing since build #3490 (Changes by Rafael Zalamena <rzalamena@users.noreply.github.com>) TopoTests Ubuntu 16.04 arm8 Part 2 1 min
Successful test_bgp_multi_vrf_topo2 test_vrf_with_multiple_links_p1 History
Failing since build #3490 (Changes by Rafael Zalamena <rzalamena@users.noreply.github.com>) TopoTests Ubuntu 16.04 arm8 Part 2 3 mins

Jira issues

IssueDescriptionStatus
Unknown Issue TypeFRR-7Could not obtain issue details from Jira