Build #3,498

FreeRangeRouting Protocol Suite

Build result summary

Details

Completed
Duration
141 minutes
Labels
version=frr-7_4-dev-1969-g6d8016115git=https_//github_com/frrouting/frr_gitbuildurl=https_//ci1_netdef_org/browse/frr-frr-3498branch=master
Revision
6d8016115a6fb9b38baf38572c63acdab349d538 6d8016115a6fb9b38baf38572c63acdab349d538
Total tests
9767
Failing since
#3497 (Changes by Russ White <russ@riw.us>)
Fixed in
#3499 (Changes by Donald Sharp)

Tests

Responsible

This build has been failing since #3497
No one has taken responsibility

Code commits

Author Commit Message Commit date
Rafael Zalamena <rzalamena@users.noreply.github.com> Rafael Zalamena <rzalamena@users.noreply.github.com> 6d8016115a6fb9b38baf38572c63acdab349d538 6d8016115a6fb9b38baf38572c63acdab349d538 Merge pull request #6333 from Spantik/ospf_default
ospf: Default-information originate with routemap
Santosh P K <sapk@vmware.com> Santosh P K <sapk@vmware.com> 1febb13de7926e36cca08badfd960865d25b2cc6 m 1febb13de7926e36cca08badfd960865d25b2cc6 ospf: Default-information originate with routemap
Default originate with route-map was broken. Routemap
was not getting applied for redistribute route but was
getting applied default route itself. No default route
was originated even when routemap was satisfied.

Signed-off-by: Santosh P K <sapk@vmware.com>

Tests

Existing test failures 2
Status Test Failing since View job Duration
AssertionError: 2 tests failed
E   AssertionError: 2 tests failed
AssertionError: 2 tests failed
E   AssertionError: 2 tests failed

Jira issues

IssueDescriptionStatus
Unknown Issue TypeFRR-7Could not obtain issue details from Jira