Build #3,512

FreeRangeRouting Protocol Suite

Build result summary

Details

Completed
Duration
164 minutes
Labels
version=frr-7_4-dev-2017-g3ab3b0f21git=https_//github_com/frrouting/frr_gitbuildurl=https_//ci1_netdef_org/browse/frr-frr-3512branch=master
Revision
3ab3b0f2118c58058e9ed4936ea9979a83105ff2 3ab3b0f2118c58058e9ed4936ea9979a83105ff2
Total tests
9767
Fixed in
#3515 (Changes by David Lamparter)

Tests

Responsible

No one has taken responsibility for this failure

Code commits

Author Commit Message Commit date
Santosh P K <50885001+Spantik@users.noreply.github.com> Santosh P K <50885001+Spantik@users.noreply.github.com> 3ab3b0f2118c58058e9ed4936ea9979a83105ff2 3ab3b0f2118c58058e9ed4936ea9979a83105ff2 Merge pull request #6446 from chiragshah6/evpn_dev
zebra: rib operational nb add vrf key
Chirag Shah Chirag Shah 20e310a9b27f825973e96e600b3953f4781e2419 m 20e310a9b27f825973e96e600b3953f4781e2419 zebra: rib operational nb add vrf key
Add vrf as key in Rib operational nexthop list

PR 6296 has added vrf as key in nexthop list.
Rib operational model uses nexthop list, adding
vrf key into northbound callback.

Signed-off-by: Chirag Shah <chirag@cumulusnetworks.com>

Tests

New test failures 2
Status Test View job Duration
Collapse Failed test_bgp_instance_del_test test_adjacencies History
TopoTests Ubuntu 16.04 arm8 Part 2 6 mins
AssertionError: 2 tests failed
E   AssertionError: 2 tests failed
Collapse Failed test_bgp_l3vpn_to_bgp_vrf test_adjacencies History
TopoTests Ubuntu 16.04 arm8 Part 2 6 mins
AssertionError: 2 tests failed
E   AssertionError: 2 tests failed

Jira issues

IssueDescriptionStatus
Unknown Issue TypeFRR-7Could not obtain issue details from Jira