Build #3,519

FreeRangeRouting Protocol Suite

Build: #3519 failed Rebuilt by Martin Winter

Build result summary

Details

Completed
Duration
353 minutes
Labels
version=frr-7_4-dev-2035-g97c8ca880git=https_//github_com/frrouting/frr_gitbuildurl=https_//ci1_netdef_org/browse/frr-frr-3519branch=master
Revision
97c8ca88082c45eaef0a51e35073b07df0cfe78d 97c8ca88082c45eaef0a51e35073b07df0cfe78d
Total tests
9767
Failing since
#3518 (Changes by David Lamparter)
Fixed in
#3537 (Changes by Russ White <russ@riw.us>)
Number of retries
1

Responsible

Code commits

Author Commit Message Commit date
David Lamparter David Lamparter 97c8ca88082c45eaef0a51e35073b07df0cfe78d 97c8ca88082c45eaef0a51e35073b07df0cfe78d Merge pull request #6777 from idryzhov/vtysh-defpy
vtysh: rework DEFPY processing in extract.pl
Igor Ryzhov <iryzhov@nfware.com> Igor Ryzhov <iryzhov@nfware.com> dc47ff5c3a8b593ab9d5e9e3aa68f62a7092561d m dc47ff5c3a8b593ab9d5e9e3aa68f62a7092561d vtysh: rework DEFPY processing in extract.pl
Currently, all DEFPY commands are translated into one-liners in
vtysh_cmd.c. After the patch, DEFPY commands are correctly indented just
like DEFUN/ALIAS commands.

Signed-off-by: Igor Ryzhov <iryzhov@nfware.com>

Tests

Existing test failures 2
Status Test Failing since View job Duration
AssertionError: 2 tests failed
E   AssertionError: 2 tests failed
AssertionError: 2 tests failed
E   AssertionError: 2 tests failed
Fixed tests 1
Status Test Failing since View job Duration
Successful test_ldp_vpls_topo1 test_memory_leak History
Failing since build #3518 (Changes by David Lamparter) TopoTests Ubuntu 16.04 arm8 Part 0 10 secs

Jira issues

IssueDescriptionStatus
Unknown Issue TypeFRR-7Could not obtain issue details from Jira