Build #3,527

FreeRangeRouting Protocol Suite

Build result summary

Details

Completed
Duration
138 minutes
Labels
version=frr-7_4-dev-2061-gd2b4eeb1fgit=https_//github_com/frrouting/frr_gitbuildurl=https_//ci1_netdef_org/browse/frr-frr-3527branch=master
Revision
d2b4eeb1fb779c6249912843c6485d940d32b357 d2b4eeb1fb779c6249912843c6485d940d32b357
Total tests
9767
Failing since
#3518 (Changes by David Lamparter)
Fixed in
#3537 (Changes by Russ White <russ@riw.us>)

Tests

Responsible

Code commits

Author Commit Message Commit date
Donatas Abraitis <donatas.abraitis@gmail.com> Donatas Abraitis <donatas.abraitis@gmail.com> d2b4eeb1fb779c6249912843c6485d940d32b357 d2b4eeb1fb779c6249912843c6485d940d32b357 Merge pull request #6793 from maduri111/bgpd-wide
bgpd: wide option
Madhuri Kuruganti <k.madhuri@samsung.com> Madhuri Kuruganti <k.madhuri@samsung.com> ae2488324ec3b3d9cd35e9f4cb757d5ced70d7c1 m ae2488324ec3b3d9cd35e9f4cb757d5ced70d7c1 bgpd: wide option
Signed-off-by: Madhuri Kuruganti <k.madhuri@samsung.com>

Tests

Existing test failures 2
Status Test Failing since View job Duration
AssertionError: 2 tests failed
E   AssertionError: 2 tests failed
AssertionError: 2 tests failed
E   AssertionError: 2 tests failed

Jira issues

IssueDescriptionStatus
Unknown Issue TypeFRR-7Could not obtain issue details from Jira