Build #3,531

FreeRangeRouting Protocol Suite

Build: #3531 failed Changes by Mark Stapp <mjs@voltanet.io>

Build result summary

Details

Completed
Duration
370 minutes
Labels
version=frr-7_4-dev-2071-g6c4b304f3git=https_//github_com/frrouting/frr_gitbuildurl=https_//ci1_netdef_org/browse/frr-frr-3531branch=master
Revision
6c4b304f3359131750aec5b07d469e735eaad855 6c4b304f3359131750aec5b07d469e735eaad855
Total tests
9819
Failing since
#3518 (Changes by David Lamparter)
Fixed in
#3537 (Changes by Russ White <russ@riw.us>)

Responsible

Code commits

Author Commit Message Commit date
Mark Stapp <mjs@voltanet.io> Mark Stapp <mjs@voltanet.io> 6c4b304f3359131750aec5b07d469e735eaad855 6c4b304f3359131750aec5b07d469e735eaad855 Merge pull request #6662 from kuldeepkash/evpn_type2_tests
tests: Adding test suites evpn_type5_test_topo1
Kuldeep Kashyap <kashyapk@vmware.com> Kuldeep Kashyap <kashyapk@vmware.com> 1b66072ce04494d11ee54f6f3486816ec8be98bc m 1b66072ce04494d11ee54f6f3486816ec8be98bc tests: Adding test suites evpn_type5_test_topo1
1. Added 15 test cases to test evpn type5 functionality
2. Total execution time is ~9 mins

Signed-off-by: Kuldeep Kashyap <kashyapk@vmware.com>
Kuldeep Kashyap <kashyapk@vmware.com> Kuldeep Kashyap <kashyapk@vmware.com> 3c334c391524159d944ffb2abf841d5f07df9721 m 3c334c391524159d944ffb2abf841d5f07df9721 tests: Adding framework support for EVPN-Type5 automation
1. Added APIs to create evpn related config.
2. Added APIs to verify evpn config and routes.

Signed-off-by: Kuldeep Kashyap <kashyapk@vmware.com>

Tests

Existing test failures 2
Status Test Failing since View job Duration
AssertionError: 2 tests failed
E   AssertionError: 2 tests failed
AssertionError: 2 tests failed
E   AssertionError: 2 tests failed
Fixed tests 2
Status Test Failing since View job Duration
Successful test_ldp_oc_topo1 test_memory_leak History
Failing since build #3530 (Changes by Donald Sharp and Donatas Abraitis <donatas.abraitis@gmail.com>) TopoTests Ubuntu 16.04 arm8 Part 0 6 secs
Successful test_ldp_vpls_topo1 test_memory_leak History
Failing since build #3530 (Changes by Donald Sharp and Donatas Abraitis <donatas.abraitis@gmail.com>) TopoTests Ubuntu 16.04 arm8 Part 0 9 secs

Jira issues

IssueDescriptionStatus
Unknown Issue TypeFRR-7Could not obtain issue details from Jira