FreeRangeRouting Protocol Suite

Build: #4378 failed Changes by Igor Ryzhov <iryzhov@nfware.com>

Stages & jobs

  1. Get Sourcecode

  2. Building Stage

  3. Basic Tests

  4. Final

    Final

Build result summary

Details

Completed
Duration
192 minutes
Labels
version=frr-7_4-dev-4837-gafb61b353git=https_//github_com/frrouting/frr_gitbuildurl=https_//ci1_netdef_org/browse/frr-frr-4378branch=master
Revision
afb61b35371e951da0ecb2ce92026c8741736b23 afb61b35371e951da0ecb2ce92026c8741736b23
Total tests
11987
Fixed in
#4379 (Changes by Patrick Ruddy <pat@voltanet.io>)

Tests

Responsible

No one has taken responsibility for this failure

Code commits

Author Commit Message Commit date
Igor Ryzhov <iryzhov@nfware.com> Igor Ryzhov <iryzhov@nfware.com> afb61b35371e951da0ecb2ce92026c8741736b23 afb61b35371e951da0ecb2ce92026c8741736b23 Merge pull request #8194 from LabNConsulting/chopps/fix-log-msg
pimd: correctly get interface name for error message
Christian Hopps <chopps@gmail.com> Christian Hopps <chopps@gmail.com> e184ea73111110f6a69e719a7b81cb5ddea25f15 m e184ea73111110f6a69e719a7b81cb5ddea25f15 pimd: correctly get interface name for error message
This was found while doing libyang2 work (causes assert); however, it is
also incorrect for libyang1 (empty canonical value for incorrectly
referenced interface vs interface-name node).

While here, fix 2 other incorrect uses of "." on a container node.

Signed-off-by: Christian Hopps <chopps@labn.net>

Configuration changes

Plan configuration has changed since the last successful build. See the plan audit log for more details.

Tests

New test failures 3
Status Test View job Duration
Collapse Failed test_bgp_auth test_multiple_vrf_prefix_peer_remove_passwords History
TopoTests Ubuntu 18.04 i386 Part 1 2 mins
AssertionError: R2 could not peer 1.1.1.1 state expected Connect got Established  assert False == True   -False   +True
E   AssertionError: R2 could not peer 1.1.1.1 state expected Connect got Established 
    assert False == True
      -False
      +True
Collapse Failed test_bgp_gr_functionality_topo1 test_BGP_GR_TC_50_p1 History
TopoTests Ubuntu 18.04 i386 Part 3 1 min
AssertionError: Testcase test_BGP_GR_TC_50_p1 : Failed     Error [DUT: r1]: localGrMode is not correct Expected: Helper*, Found: Helper assert '[DUT: r1]: localGrMode is not correct Expected: Helper*, Found: Helper' is True
E   AssertionError: Testcase test_BGP_GR_TC_50_p1 : Failed 
       Error [DUT: r1]: localGrMode is not correct Expected: Helper*, Found: Helper
    assert '[DUT: r1]: localGrMode is not correct Expected: Helper*, Found: Helper' is True
Collapse Failed test_evpn_type5_topo1 test_evpn_routes_from_VNFs_p1 History
TopoTests Ubuntu 18.04 i386 Part 6 1 min
AssertionError: Testcase test_evpn_routes_from_VNFs_p1 :Failed     Error: [DUT: d2]: Missing route in RIB, routes: ['20::1/128'] assert "[DUT: d2]: Missing route in RIB, routes: ['20::1/128']" is True
E   AssertionError: Testcase test_evpn_routes_from_VNFs_p1 :Failed 
       Error: [DUT: d2]: Missing route in RIB, routes: ['20::1/128']
    assert "[DUT: d2]: Missing route in RIB, routes: ['20::1/128']" is True