FreeRangeRouting Protocol Suite

Build: #4519 failed Changes by Patrick Ruddy <pat@voltanet.io>

Stages & jobs

  1. Get Sourcecode

  2. Building Stage

  3. Basic Tests

  4. Final

    Final

Build result summary

Details

Completed
Duration
186 minutes
Labels
version=frr-7_4-dev-5347-gfb94a2e65git=https_//github_com/frrouting/frr_gitbuildurl=https_//ci1_netdef_org/browse/frr-frr-4519branch=master
Revision
fb94a2e65dbf740b4bbd1d5eec00fb3b2e7d62c5 fb94a2e65dbf740b4bbd1d5eec00fb3b2e7d62c5
Total tests
12191
Fixed in
#4521 (Changes by Patrick Ruddy <pat@voltanet.io>)

Responsible

No one has taken responsibility for this failure

Code commits

Author Commit Message Commit date
Patrick Ruddy <pat@voltanet.io> Patrick Ruddy <pat@voltanet.io> fb94a2e65dbf740b4bbd1d5eec00fb3b2e7d62c5 fb94a2e65dbf740b4bbd1d5eec00fb3b2e7d62c5 Merge pull request #8402 from opensourcerouting/debian10-topotest-fix
tests: fix for l3mdev topotests on kernel 4.19
David Schweizer David Schweizer 6a93e3df4e7c0b56137a130127c1408cfe75ea0c m 6a93e3df4e7c0b56137a130127c1408cfe75ea0c tests: fix python3 backported iproute2 vrf check
Signed-off-by: David Schweizer <dschweizer@opensourcerouting.org>
David Schweizer David Schweizer b04af734aa33f87484da20af0c61458f076e09fb m b04af734aa33f87484da20af0c61458f076e09fb tests: fix l3mdev config in isis-topo1-vrf topotest
Signed-off-by: David Schweizer <dschweizer@opensourcerouting.org>
David Schweizer David Schweizer b7589f4e5cb804dd414150b0dc2cca0cec3aec72 m b7589f4e5cb804dd414150b0dc2cca0cec3aec72 tests: fix l3mdev config in bgp_vrf_lite_ipv6_rtadv topotest
Signed-off-by: David Schweizer <dschweizer@opensourcerouting.org>
David Schweizer David Schweizer f2d729056e6915cb393b16c354892f39247c512c m f2d729056e6915cb393b16c354892f39247c512c tests: fix l3mdev config in bgp_l3vpn_to_bgp_vrf topotest
Signed-off-by: David Schweizer <dschweizer@opensourcerouting.org>

Tests

New test failures 3
Status Test View job Duration
Collapse Failed test_bgp_vrf_ipv6_ll_func test_bgp_vrf_link_local History
TopoTests Ubuntu 18.04 arm8 Part 6 1 min
AssertionError: Failed bgp convergence in "TopoGear<name="r1",links=["r1-eth0"<->"s1-eth0","r1-eth1"<->"s2-eth0"]> TopoRouter<>" assert Generated JSON diff error report:      > $->fe80:1::2->bgpState: d1 has element with value 'Active' but in d2 it has value 'Established'
E   AssertionError: Failed bgp convergence in "TopoGear<name="r1",links=["r1-eth0"<->"s1-eth0","r1-eth1"<->"s2-eth0"]> TopoRouter<>"
    assert Generated JSON diff error report:
      
      > $->fe80:1::2->bgpState: d1 has element with value 'Active' but in d2 it has value 'Established'
Collapse Failed test_bgp_vrf_ipv6_ll_func test_bgp_vrf_link_local History
TopoTests Ubuntu 18.04 i386 Part 6 49 secs
AssertionError: Failed bgp convergence in "TopoGear<name="r1",links=["r1-eth0"<->"s1-eth0","r1-eth1"<->"s2-eth0"]> TopoRouter<>" assert Generated JSON diff error report:      > $->fe80:1::2->bgpState: d1 has element with value 'Active' but in d2 it has value 'Established'
E   AssertionError: Failed bgp convergence in "TopoGear<name="r1",links=["r1-eth0"<->"s1-eth0","r1-eth1"<->"s2-eth0"]> TopoRouter<>"
    assert Generated JSON diff error report:
      
      > $->fe80:1::2->bgpState: d1 has element with value 'Active' but in d2 it has value 'Established'
Collapse Failed test_bgp_vrf_ipv6_ll_func test_bgp_vrf_link_local History
TopoTests Ubuntu 18.04 amd64 Part 6 45 secs
AssertionError: Failed bgp convergence in "TopoGear<name="r1",links=["r1-eth0"<->"s1-eth0","r1-eth1"<->"s2-eth0"]> TopoRouter<>" assert Generated JSON diff error report:      > $->fe80:1::2->bgpState: d1 has element with value 'Active' but in d2 it has value 'Established'
E   AssertionError: Failed bgp convergence in "TopoGear<name="r1",links=["r1-eth0"<->"s1-eth0","r1-eth1"<->"s2-eth0"]> TopoRouter<>"
    assert Generated JSON diff error report:
      
      > $->fe80:1::2->bgpState: d1 has element with value 'Active' but in d2 it has value 'Established'
Fixed tests 1
Status Test Failing since View job Duration
Successful test_bgp_multi_vrf_topo2 test_delete_and_re_add_vrf_p1 History
Failing since build #4452 (Changes by Donatas Abraitis <donatas.abraitis@gmail.com>) TopoTests Ubuntu 18.04 arm8 Part 5 1 min