Build #2,095

FreeRangeRouting Protocol Suite

Build: #2095 failed

Job: Topology Tests on Ubuntu 16.04 arm8 failed

Job result summary

Completed
Duration
31 minutes
Agent
mininet-arm8-02.lab.netdef.org
Total tests
134
Fixed in
#2096 (Code changes detected)

Tests

  • 134 tests in total
  • 1 test failed
  • 1 failure is new
  • 1 test was quarantined / skipped
  • 30 minutes taken in total.
New test failures 1
Status Test Duration
Collapse Failed test_bfd_topo2 test_protocols_convergence History
3 mins
AssertionError: "r1" JSON output mismatches assert json value is different (   --- Expected value   +++ Current value   @@ -2,0 +3 @@   +        "destSelected": true,    @@ -4 +5 @@   -        "installed": true,    +        "failed": true,    @@ -6 +7 @@   -        "internalStatus": 34,    +        "internalStatus": 66,    @@ -12,2 +13 @@   -                "fib": true,    -                "flags": 3,    +                "flags": 1,    @@ -15 +15,2 @@   -                "interfaceName": "r1-eth0"   +                "interfaceName": "r1-eth0",    +                "ip": "fe80::302c:ebff:fe07:f02c"   @@ -20 +21,2 @@   -        "selected": true   +        "selected": true,    +        "uptime": "00:02:47")
E   AssertionError: "r1" JSON output mismatches
    assert json value is different (
      --- Expected value
      +++ Current value
      @@ -2,0 +3 @@
      +        "destSelected": true, 
      @@ -4 +5 @@
(17 more lines...)

Error summary

The build generated some errors. See the full build log for more details.

dpkg: dependency problems prevent configuration of frr-rpki-rtrlib:
frr-rpki-rtrlib depends on librtr0; however:
  Package librtr0 is not installed.

dpkg: error processing package frr-rpki-rtrlib (--install):
dependency problems - leaving unconfigured
Errors were encountered while processing:
frr-rpki-rtrlib
ci/topotests/run_topotests.sh: line 2: g: command not found
2019-04-16 16:10:21,662 ERROR: 'router_json_cmp' failed after 160.31 seconds
2019-04-16 16:10:21,667 ERROR: assert failed at "test_bfd_topo2/test_protocols_convergence": "r1" JSON output mismatches
assert json value is different (
  --- Expected value
  +++ Current value
  @@ -2,0 +3 @@
  +        "destSelected": true,
  @@ -4 +5 @@
  -        "installed": true,
  +        "failed": true,
  @@ -6 +7 @@
  -        "internalStatus": 34,
  +        "internalStatus": 66,
  @@ -12,2 +13 @@
  -                "fib": true,
  -                "flags": 3,
  +                "flags": 1,
  @@ -15 +15,2 @@
  -                "interfaceName": "r1-eth0"
  +                "interfaceName": "r1-eth0",
  +                "ip": "fe80::302c:ebff:fe07:f02c"
  @@ -20 +21,2 @@
  -        "selected": true
  +        "selected": true,
  +        "uptime": "00:02:47")
*** defaultIntf: warning: r1 has no interfaces
*** defaultIntf: warning: r1 has no interfaces
*** defaultIntf: warning: lm has no interfaces