Build #2,965

FreeRangeRouting Protocol Suite

Build: #2965 failed Changes by Donald Sharp

Build result summary

Details

Completed
Duration
231 minutes
Labels
version=frr-7_4-dev-233-gb15968b11git=https_//github_com/frrouting/frr_gitbuildurl=https_//ci1_netdef_org/browse/frr-frr-2965branch=master
Revision
b15968b11f42321e33f49bcdbf0d22987f3e74ce b15968b11f42321e33f49bcdbf0d22987f3e74ce
Total tests
8349

Tests

Responsible

Code commits

Author Commit Message Commit date
Donald Sharp Donald Sharp b15968b11f42321e33f49bcdbf0d22987f3e74ce b15968b11f42321e33f49bcdbf0d22987f3e74ce Merge pull request #5814 from Jafaral/nhrp-no
nhrpd: allow no nhrp map cmd to match the configured cmd
Jafar Al-Gharaibeh <jafar@atcorp.com> Jafar Al-Gharaibeh <jafar@atcorp.com> 29ff6b5cb660c8f2a6d205f0617b2356235ad73e m 29ff6b5cb660c8f2a6d205f0617b2356235ad73e nhrpd: allow no nhrp map cmd to match the configured cmd
Signed-off-by: Jafar Al-Gharaibeh <jafar@atcorp.com>

Tests

New test failures 260
Status Test View job Duration
Collapse Failed test_all_protocol_startup test_nexthop_groups History
Topology Tests on Ubuntu 16.04 i386 < 1 sec
AssertionError: Nexthop Group ID=83 not marked Valid assert None is not None
E   AssertionError: Nexthop Group ID=83 not marked Valid
    assert None is not None
Collapse Failed test_all_protocol_startup test_bgp_summary History
Topology Tests on Ubuntu 16.04 i386 < 1 sec
AssertionError: SHOW IP BGP SUMMARY failed for router r1:   --- actual SHOW IP BGP SUMMARY   +++ expected SHOW IP BGP SUMMARY   @@ -1 +1,10 @@   +BGP router identifier 192.168.0.1, local AS number 100 vrf-id 0   +BGP table version 1   +RIB entries 1, using XXXX bytes of memory   +Peers 4, using XXXX KiB of memory       +Neighbor         V         AS MsgRcvd MsgSent   TblVer  InQ OutQ  Up/Down State/PfxRcd   +192.168.7.10     4        100       0       0        0    0    0    never       Active   +192.168.7.20     4        200       0       0        0    0    0    never       Active   +fc00:0:0:8::1000 4        100       0       0        0    0    0    never       Active   +fc00:0:0:8::2000 4        200       0       0        0    0    0    never       Active assert 1 == 0   -1   +0
E   AssertionError: SHOW IP BGP SUMMARY failed for router r1:
      --- actual SHOW IP BGP SUMMARY
      +++ expected SHOW IP BGP SUMMARY
      @@ -1 +1,10 @@
      +BGP router identifier 192.168.0.1, local AS number 100 vrf-id 0
      +BGP table version 1
      +RIB entries 1, using XXXX bytes of memory
(10 more lines...)
Collapse Failed test_all_protocol_startup test_shutdown_check_memleak History
Topology Tests on Ubuntu 16.04 i386 1 sec
test teardown failure
E   OSError: [Errno 12] Cannot allocate memory
Collapse Failed test_bfd_bgp_cbit_topo3 test_protocols_convergence History
Topology Tests on Ubuntu 16.04 i386 < 1 sec
test setup failure
E   OSError: [Errno 12] Cannot allocate memory
Collapse Failed test_bfd_bgp_cbit_topo3 test_bfd_connection History
Topology Tests on Ubuntu 16.04 i386 < 1 sec
test setup failure
E   OSError: [Errno 12] Cannot allocate memory
Collapse Failed test_bfd_bgp_cbit_topo3 test_bfd_comes_back_again History
Topology Tests on Ubuntu 16.04 i386 < 1 sec
test setup failure
E   OSError: [Errno 12] Cannot allocate memory
Collapse Failed test_bfd_bgp_cbit_topo3 test_memory_leak History
Topology Tests on Ubuntu 16.04 i386 < 1 sec
test setup failure
E   OSError: [Errno 12] Cannot allocate memory
Collapse Failed test_bfd_bgp_cbit_topo3 test_bfd_loss_intermediate History
Topology Tests on Ubuntu 16.04 i386 < 1 sec
test setup failure
E   OSError: [Errno 12] Cannot allocate memory
Collapse Failed test_bfd_topo1 test_bfd_connection History
Topology Tests on Ubuntu 16.04 i386 < 1 sec
test setup failure
E   OSError: [Errno 12] Cannot allocate memory
Collapse Failed test_bfd_topo1 test_bgp_fast_reconvergence History
Topology Tests on Ubuntu 16.04 i386 < 1 sec
test setup failure
E   OSError: [Errno 12] Cannot allocate memory
Collapse Failed test_bfd_topo1 test_bgp_convergence History
Topology Tests on Ubuntu 16.04 i386 < 1 sec
test setup failure
E   OSError: [Errno 12] Cannot allocate memory
Collapse Failed test_bfd_topo1 test_bgp_fast_convergence History
Topology Tests on Ubuntu 16.04 i386 < 1 sec
test setup failure
E   OSError: [Errno 12] Cannot allocate memory
Collapse Failed test_bfd_topo1 test_memory_leak History
Topology Tests on Ubuntu 16.04 i386 < 1 sec
test setup failure
E   OSError: [Errno 12] Cannot allocate memory
Collapse Failed test_bfd_topo1 test_bfd_fast_convergence History
Topology Tests on Ubuntu 16.04 i386 < 1 sec
test setup failure
E   OSError: [Errno 12] Cannot allocate memory
Collapse Failed test_bfd_topo2 test_bfd_connection History
Topology Tests on Ubuntu 16.04 i386 < 1 sec
test setup failure
E   OSError: [Errno 12] Cannot allocate memory
Collapse Failed test_bfd_topo2 test_memory_leak History
Topology Tests on Ubuntu 16.04 i386 < 1 sec
test setup failure
E   OSError: [Errno 12] Cannot allocate memory
Collapse Failed test_bfd_topo2 test_protocols_convergence History
Topology Tests on Ubuntu 16.04 i386 < 1 sec
test setup failure
E   OSError: [Errno 12] Cannot allocate memory
Collapse Failed test_bfd_vrf_topo1 test_bgp_fast_reconvergence History
Topology Tests on Ubuntu 16.04 i386 < 1 sec
test setup failure
E   OSError: [Errno 12] Cannot allocate memory
Collapse Failed test_bfd_vrf_topo1 test_memory_leak History
Topology Tests on Ubuntu 16.04 i386 < 1 sec
test setup failure
E   OSError: [Errno 12] Cannot allocate memory
Collapse Failed test_bfd_vrf_topo1 test_bfd_connection History
Topology Tests on Ubuntu 16.04 i386 < 1 sec
test setup failure
E   OSError: [Errno 12] Cannot allocate memory
Collapse Failed test_bfd_vrf_topo1 test_bgp_convergence History
Topology Tests on Ubuntu 16.04 i386 < 1 sec
test setup failure
E   OSError: [Errno 12] Cannot allocate memory
Collapse Failed test_bfd_vrf_topo1 test_bgp_fast_convergence History
Topology Tests on Ubuntu 16.04 i386 < 1 sec
test setup failure
E   OSError: [Errno 12] Cannot allocate memory
Collapse Failed test_bfd_vrf_topo1 test_bfd_fast_convergence History
Topology Tests on Ubuntu 16.04 i386 < 1 sec
test setup failure
E   OSError: [Errno 12] Cannot allocate memory
Collapse Failed test_bgp_aggregate-address_route-map test_bgp_maximum_prefix_invalid History
Topology Tests on Ubuntu 16.04 i386 < 1 sec
test setup failure
E   OSError: [Errno 12] Cannot allocate memory
Collapse Failed test_bgp_basic_functionality test_bgp_with_loopback_interface History
Topology Tests on Ubuntu 16.04 i386 < 1 sec
test setup failure
E   OSError: [Errno 12] Cannot allocate memory
Collapse Failed test_bgp_basic_functionality test_static_routes History
Topology Tests on Ubuntu 16.04 i386 < 1 sec
test setup failure
E   OSError: [Errno 12] Cannot allocate memory
Collapse Failed test_bgp_basic_functionality test_bgp_timers_functionality History
Topology Tests on Ubuntu 16.04 i386 < 1 sec
test setup failure
E   OSError: [Errno 12] Cannot allocate memory
Collapse Failed test_bgp_basic_functionality test_modify_and_delete_router_id History
Topology Tests on Ubuntu 16.04 i386 < 1 sec
test setup failure
E   OSError: [Errno 12] Cannot allocate memory
Collapse Failed test_bgp_basic_functionality test_admin_distance_for_existing_static_routes History
Topology Tests on Ubuntu 16.04 i386 < 1 sec
test setup failure
E   OSError: [Errno 12] Cannot allocate memory
Collapse Failed test_bgp_basic_functionality test_bgp_config_with_4byte_as_number History
Topology Tests on Ubuntu 16.04 i386 < 1 sec
test setup failure
E   OSError: [Errno 12] Cannot allocate memory
Collapse Failed test_bgp_basic_functionality test_clear_bgp_and_verify History
Topology Tests on Ubuntu 16.04 i386 < 1 sec
test setup failure
E   OSError: [Errno 12] Cannot allocate memory
Collapse Failed test_bgp_basic_functionality test_advertise_network_using_network_command History
Topology Tests on Ubuntu 16.04 i386 < 1 sec
test setup failure
E   OSError: [Errno 12] Cannot allocate memory
Collapse Failed test_bgp_comm-list_delete test_bgp_maximum_prefix_invalid History
Topology Tests on Ubuntu 16.04 i386 < 1 sec
test setup failure
E   OSError: [Errno 12] Cannot allocate memory
Collapse Failed test_bgp_default-originate_route-map test_bgp_default_originate_route_map History
Topology Tests on Ubuntu 16.04 i386 < 1 sec
test setup failure
E   OSError: [Errno 12] Cannot allocate memory
Collapse Failed test_bgp_distance_change test_bgp_maximum_prefix_invalid History
Topology Tests on Ubuntu 16.04 i386 < 1 sec
test setup failure
E   OSError: [Errno 12] Cannot allocate memory
Collapse Failed test_bgp_ebgp_requires_policy test_ebgp_requires_policy History
Topology Tests on Ubuntu 16.04 i386 < 1 sec
test setup failure
E   OSError: [Errno 12] Cannot allocate memory
Collapse Failed test_bgp_ecmp_topo1 test_bgp_convergence History
Topology Tests on Ubuntu 16.04 i386 < 1 sec
test setup failure
E   OSError: [Errno 12] Cannot allocate memory
Collapse Failed test_bgp_ecmp_topo1 test_bgp_ecmp History
Topology Tests on Ubuntu 16.04 i386 < 1 sec
test setup failure
E   OSError: [Errno 12] Cannot allocate memory
Collapse Failed test_ebgp_ecmp_topo2 test_modify_ecmp_max_paths[redist_static-32] History
Topology Tests on Ubuntu 16.04 i386 < 1 sec
test setup failure
E   OSError: [Errno 12] Cannot allocate memory
Collapse Failed test_ebgp_ecmp_topo2 test_ecmp_after_clear_bgp History
Topology Tests on Ubuntu 16.04 i386 < 1 sec
test setup failure
E   OSError: [Errno 12] Cannot allocate memory
Collapse Failed test_ebgp_ecmp_topo2 test_modify_ecmp_max_paths[advertise_nw-16] History
Topology Tests on Ubuntu 16.04 i386 < 1 sec
test setup failure
E   OSError: [Errno 12] Cannot allocate memory
Collapse Failed test_ebgp_ecmp_topo2 test_modify_ecmp_max_paths[advertise_nw-8] History
Topology Tests on Ubuntu 16.04 i386 < 1 sec
test setup failure
E   OSError: [Errno 12] Cannot allocate memory
Collapse Failed test_ebgp_ecmp_topo2 test_ecmp_remove_static_route History
Topology Tests on Ubuntu 16.04 i386 < 1 sec
test setup failure
E   OSError: [Errno 12] Cannot allocate memory
Collapse Failed test_ebgp_ecmp_topo2 test_modify_ecmp_max_paths[redist_static-8] History
Topology Tests on Ubuntu 16.04 i386 < 1 sec
test setup failure
E   OSError: [Errno 12] Cannot allocate memory
Collapse Failed test_ebgp_ecmp_topo2 test_modify_ecmp_max_paths[redist_static-16] History
Topology Tests on Ubuntu 16.04 i386 < 1 sec
test setup failure
E   OSError: [Errno 12] Cannot allocate memory
Collapse Failed test_ebgp_ecmp_topo2 test_ecmp_shut_bgp_neighbor History
Topology Tests on Ubuntu 16.04 i386 < 1 sec
test setup failure
E   OSError: [Errno 12] Cannot allocate memory
Collapse Failed test_ebgp_ecmp_topo2 test_ecmp_remove_nw_advertise History
Topology Tests on Ubuntu 16.04 i386 < 1 sec
test setup failure
E   OSError: [Errno 12] Cannot allocate memory
Collapse Failed test_ebgp_ecmp_topo2 test_modify_ecmp_max_paths[advertise_nw-32] History
Topology Tests on Ubuntu 16.04 i386 < 1 sec
test setup failure
E   OSError: [Errno 12] Cannot allocate memory
Collapse Failed test_ebgp_ecmp_topo2 test_ecmp_remove_redistribute_static History
Topology Tests on Ubuntu 16.04 i386 < 1 sec
test setup failure
E   OSError: [Errno 12] Cannot allocate memory
Collapse Failed test_ibgp_ecmp_topo2 test_ecmp_remove_redistribute_static History
Topology Tests on Ubuntu 16.04 i386 < 1 sec
test setup failure
E   OSError: [Errno 12] Cannot allocate memory