Build #1

FreeRangeRouting Protocol Suite

Build: #1 failed First build for this plan

Build result summary

Details

Completed
Duration
153 minutes
Labels
version=frr-6_1-dev-1388-gc2b04b0c9git=https_//github_com/frrouting/frr_gitbuildurl=https_//ci1_netdef_org/browse/frr-frr22-1branch=revert-3174-feature/isis-triggered-hello
Revision
c2b04b0c9fb98b1b2419027996c4de3f4c986c93 c2b04b0c9fb98b1b2419027996c4de3f4c986c93
Total tests
7156

Tests

Responsible

No one has taken responsibility for this failure

Tests

New test failures 11
Status Test View job Duration
Collapse Failed test_bfd_topo1 test_bgp_convergence History
Topology Tests on Ubuntu 16.04 arm8 22 secs
AssertionError: r2: bgp did not converge assert json["ipv4Unicast"]["peers"]["192.168.1.1"]["state"] value is different (   --- Expected value   +++ Current value   @@ -1 +1 @@   -"Established"   +"Active")
E   AssertionError: r2: bgp did not converge
    assert json["ipv4Unicast"]["peers"]["192.168.1.1"]["state"] value is different (
      --- Expected value
      +++ Current value
      @@ -1 +1 @@
      -"Established"
      +"Active")
Collapse Failed test_bfd_topo1 test_bgp_fast_reconvergence History
Topology Tests on Ubuntu 16.04 arm8 6 secs
AssertionError: r4: bgp did not converge assert expected key(s) [u'10.254.254.3/32'] in json["routes"] (have [u'10.254.254.4/32', u'10.254.254.2/32']):   --- Expected value   +++ Current value   @@ -2 +1,0 @@   -    "10.254.254.1/32": null,    @@ -5,0 +5,4 @@   +            "bestpath": true,    +            "med": 0,    +            "metric": 0,    +            "network": "10.254.254.2/32",    @@ -12,0 +16,3 @@   +            "origin": "IGP",    +            "path": "102",    +            "pathFrom": "external",    @@ -16 +22,2 @@   -            "valid": true   +            "valid": true,    +            "weight": 0   @@ -19 +26 @@   -    "10.254.254.3/32": [   +    "10.254.254.4/32": [   @@ -21 +28,5 @@   -            "aspath": "102 103",    +            "aspath": "",    +            "bestpath": true,    +            "med": 0,    +            "metric": 0,    +            "network": "10.254.254.4/32",    @@ -25 +36 @@   -                    "ip": "192.168.2.2",    +                    "ip": "0.0.0.0",    @@ -29,2 +40,5 @@   -            "peerId": "192.168.2.2",    -            "prefix": "10.254.254.3",    +            "origin": "IGP",    +            "path": "",    +            "pathFrom": "external",    +            "peerId": "(unspec)",    +            "prefix": "10.254.254.4",    @@ -32 +46,2 @@   -            "valid": true   +            "valid": true,    +            "weight": 32768
E   AssertionError: r4: bgp did not converge
    assert expected key(s) [u'10.254.254.3/32'] in json["routes"] (have [u'10.254.254.4/32', u'10.254.254.2/32']):
      --- Expected value
      +++ Current value
      @@ -2 +1,0 @@
      -    "10.254.254.1/32": null, 
      @@ -5,0 +5,4 @@
(37 more lines...)
Collapse Failed test_bfd_topo1 test_bgp_fast_convergence History
Topology Tests on Ubuntu 16.04 arm8 40 secs
AssertionError: r4: bgp did not converge assert expected key(s) [u'10.254.254.3/32'] in json["routes"] (have [u'10.254.254.4/32', u'10.254.254.2/32', u'10.254.254.1/32']):   --- Expected value   +++ Current value   @@ -4,0 +5,2 @@   +            "bestpath": true,    +            "network": "10.254.254.1/32",    @@ -11,0 +14,3 @@   +            "origin": "IGP",    +            "path": "102 101",    +            "pathFrom": "external",    @@ -15 +20,2 @@   -            "valid": true   +            "valid": true,    +            "weight": 0   @@ -20,0 +27,4 @@   +            "bestpath": true,    +            "med": 0,    +            "metric": 0,    +            "network": "10.254.254.2/32",    @@ -27,0 +38,3 @@   +            "origin": "IGP",    +            "path": "102",    +            "pathFrom": "external",    @@ -31 +44,2 @@   -            "valid": true   +            "valid": true,    +            "weight": 0   @@ -34 +48 @@   -    "10.254.254.3/32": [   +    "10.254.254.4/32": [   @@ -36 +50,5 @@   -            "aspath": "102 103",    +            "aspath": "",    +            "bestpath": true,    +            "med": 0,    +            "metric": 0,    +            "network": "10.254.254.4/32",    @@ -40 +58 @@   -                    "ip": "192.168.2.2",    +                    "ip": "0.0.0.0",    @@ -44,2 +62,5 @@   -            "peerId": "192.168.2.2",    -            "prefix": "10.254.254.3",    +            "origin": "IGP",    +            "path": "",    +            "pathFrom": "external",    +            "peerId": "(unspec)",    +            "prefix": "10.254.254.4",    @@ -47 +68,2 @@   -            "valid": true   +            "valid": true,    +            "weight": 32768
E   AssertionError: r4: bgp did not converge
    assert expected key(s) [u'10.254.254.3/32'] in json["routes"] (have [u'10.254.254.4/32', u'10.254.254.2/32', u'10.254.254.1/32']):
      --- Expected value
      +++ Current value
      @@ -4,0 +5,2 @@
      +            "bestpath": true, 
      +            "network": "10.254.254.1/32", 
(46 more lines...)
Collapse Failed test_bgp_l3vpn_to_bgp_direct test_adjacencies History

Failing on the master branch.

Topology Tests on Ubuntu 16.04 arm7 1 min
AssertionError: 3 tests failed
E   AssertionError: 3 tests failed
Collapse Failed test_bgp_rfapi_basic_sanity_config2 test_adjacencies History

Failing on the master branch.

Topology Tests on Ubuntu 16.04 arm7 1 min
AssertionError: 3 tests failed
E   AssertionError: 3 tests failed
Collapse Failed test_bgp_rfapi_basic_sanity test_adjacencies History

Failing on the master branch.

Topology Tests on Ubuntu 16.04 arm7 1 min
AssertionError: 3 tests failed
E   AssertionError: 3 tests failed
Collapse Failed test_ldp_topo1 test_mpls_ldp_binding History

Failing on the master branch.

Topology Tests on Ubuntu 16.04 arm7 3 secs
AssertionError: MPLS LDP Interface binding output for router r4:   --- actual MPLS LDP binding output   +++ expected MPLS LDP binding output   @@ -12,4 +12,4 @@    ipv4 10.0.2.0/24          2.2.2.2         imp-null    imp-null          no    ipv4 10.0.2.0/24          3.3.3.3         imp-null    imp-null          no    ipv4 10.0.3.0/24          2.2.2.2         xxx         imp-null         yes   -ipv4 10.0.3.0/24          3.3.3.3         xxx         imp-null          no   +ipv4 10.0.3.0/24          3.3.3.3         xxx         imp-null         yes assert 1 == 0
E   AssertionError: MPLS LDP Interface binding output for router r4:
      --- actual MPLS LDP binding output
      +++ expected MPLS LDP binding output
      @@ -12,4 +12,4 @@
       ipv4 10.0.2.0/24          2.2.2.2         imp-null    imp-null          no
       ipv4 10.0.2.0/24          3.3.3.3         imp-null    imp-null          no
       ipv4 10.0.3.0/24          2.2.2.2         xxx         imp-null         yes
(3 more lines...)
Collapse Failed test_ldp_topo1 test_mpls_table History

Failing on the master branch.

Topology Tests on Ubuntu 16.04 arm7 2 secs
AssertionError: MPLS table output for router r2:   --- actual MPLS table output   +++ expected MPLS table output   @@ -2,5 +2,6 @@       Label     Type          Nexthop     Label    --------  -------  ---------------  --------          XX      LDP         10.0.1.1  implicit-null   +      XX      LDP         10.0.2.3  implicit-null          XX      LDP         10.0.2.4  implicit-null          XX      LDP         10.0.3.3  implicit-null assert 1 == 0
E   AssertionError: MPLS table output for router r2:
      --- actual MPLS table output
      +++ expected MPLS table output
      @@ -2,5 +2,6 @@
          Label     Type          Nexthop     Label
       --------  -------  ---------------  --------
             XX      LDP         10.0.1.1  implicit-null
(4 more lines...)
Collapse Failed test_ldp_topo1 test_linux_mpls_routes History

Failing on the master branch.

Topology Tests on Ubuntu 16.04 arm7 < 1 sec
AssertionError: Linux Kernel MPLS route output for router r2:   --- actual Linux Kernel MPLS route   +++ expected Linux Kernel MPLS route   @@ -1,3 +1,3 @@   +xx proto xx nexthopvia inet 10.0.2.3 dev r2-eth1 nexthopvia inet 10.0.3.3 dev r2-eth2    xx via inet 10.0.1.1 dev r2-eth0 proto xx    xx via inet 10.0.2.4 dev r2-eth1 proto xx   -xx via inet 10.0.3.3 dev r2-eth2 proto xx assert 1 == 0
E   AssertionError: Linux Kernel MPLS route output for router r2:
      --- actual Linux Kernel MPLS route
      +++ expected Linux Kernel MPLS route
      @@ -1,3 +1,3 @@
      +xx proto xx nexthopvia inet 10.0.2.3 dev r2-eth1 nexthopvia inet 10.0.3.3 dev r2-eth2
       xx via inet 10.0.1.1 dev r2-eth0 proto xx
       xx via inet 10.0.2.4 dev r2-eth1 proto xx
(2 more lines...)
Collapse Failed test_ldp_topo1 test_zebra_ipv4_routingTable History

Failing on the master branch.

Topology Tests on Ubuntu 16.04 arm7 1 sec
AssertionError: IPv4 Zebra Routing Table verification failed for router r2:   --- actual IPv4 zebra routing table   +++ expected IPv4 zebra routing table   @@ -1,6 +1,6 @@    O>* 1.1.1.1/32 [110/10] via 10.0.1.1, r2-eth0, label implicit-null    O   2.2.2.2/32 [110/0] is directly connected, lo   -O>  3.3.3.3/32 [110/10] via 10.0.2.3, r2-eth1   +O>* 3.3.3.3/32 [110/10] via 10.0.2.3, r2-eth1, label implicit-null    O>* 4.4.4.4/32 [110/10] via 10.0.2.4, r2-eth1, label implicit-null    O   10.0.1.0/24 [110/10] is directly connected, r2-eth0    O   10.0.2.0/24 [110/10] is directly connected, r2-eth1 assert 1 == 0
E   AssertionError: IPv4 Zebra Routing Table verification failed for router r2:
      --- actual IPv4 zebra routing table
      +++ expected IPv4 zebra routing table
      @@ -1,6 +1,6 @@
       O>* 1.1.1.1/32 [110/10] via 10.0.1.1, r2-eth0, label implicit-null
       O   2.2.2.2/32 [110/0] is directly connected, lo
      -O>  3.3.3.3/32 [110/10] via 10.0.2.3, r2-eth1
(5 more lines...)
Collapse Failed test_ldp_vpls_topo1 test_rib History

Failing on the master branch.

Topology Tests on Ubuntu 16.04 arm7 3 mins
AssertionError: "r1" JSON output mismatches the expected result assert json value is different (   --- Expected value   +++ Current value   @@ -3,0 +4,2 @@   +        "internalFlags": 16,    +        "internalStatus": 2,    @@ -9 +11 @@   -                "fib": true,    +                "flags": 1,    @@ -17 +19 @@   -                "fib": true,    +                "flags": 1,    @@ -25 +27,2 @@   -        "selected": true   +        "selected": true,    +        "uptime": "00:03:54")
E   AssertionError: "r1" JSON output mismatches the expected result
    assert json value is different (
      --- Expected value
      +++ Current value
      @@ -3,0 +4,2 @@
      +        "internalFlags": 16, 
      +        "internalStatus": 2, 
(10 more lines...)