Build #1

FreeRangeRouting Protocol Suite

Build: #1 failed First build for this plan

Build result summary

Details

Completed
Duration
134 minutes
Labels
version=frr-7_1-dev-973-g231e94e32git=https_//github_com/frrouting/frr_gitbuildurl=https_//ci1_netdef_org/browse/frr-frr34-1branch=revert-4137-te
Revision
231e94e32a9dca4c2d3c7deea52293c1adcc39d3 231e94e32a9dca4c2d3c7deea52293c1adcc39d3
Total tests
6651

Tests

Responsible

No one has taken responsibility for this failure

Tests

New test failures 2
Status Test View job Duration
Collapse Failed test_bgp_l3vpn_to_bgp_direct test_adjacencies History
Topology Tests on Ubuntu 18.04 amd64 1 min
AssertionError: 1 tests failed
E   AssertionError: 1 tests failed
Collapse Failed test_bgp_l3vpn_to_bgp_vrf test_adjacencies History
Topology Tests on Ubuntu 16.04 amd64 46 secs
AssertionError: 2 tests failed
E   AssertionError: 2 tests failed