Build #1

FreeRangeRouting Protocol Suite

Build: #1 failed First build for this plan

Build result summary

Details

Completed
Duration
100 minutes
Labels
version=frr-7_1-dev-1908-ga36898e75git=https_//github_com/frrouting/frr_gitbuildurl=https_//ci1_netdef_org/browse/frr-frr41-1branch=revert-3775-ospf_missing_interface_handling_2
Revision
a36898e7555036c786f7aa944b848966b45d5897 a36898e7555036c786f7aa944b848966b45d5897
Total tests
7593
No failed tests found, a possible compilation error occurred.

Tests

Responsible

No one has taken responsibility for this failure

Error summary for Ubuntu 16.04 ARM8 build

The job generated some errors, drill down into the full build log for more details.

W: Unable to locate package debianpkg/control
mk-build-deps: Unable to find package name in `apt-cache showsrc debianpkg/control'
WARNING: this script should be executed from a git tree
configure.ac:171: installing './compile'
configure.ac:25: installing './config.guess'
configure.ac:25: installing './config.sub'
configure.ac:100: installing './install-sh'
configure.ac:100: installing './missing'
Makefile.am: installing './depcomp'
configure.ac: installing './ylwrap'
mv: '../frr_7.2-dev-20190623-00-ga36898e75-0.dsc' and '/home/ci/cibuild.1/debwork/frr_7.2-dev-20190623-00-ga36898e75-0.dsc' are the same file
mv: '../frr_7.2-dev-20190623-00-ga36898e75-0.debian.tar.xz' and '/home/ci/cibuild.1/debwork/frr_7.2-dev-20190623-00-ga36898e75-0.debian.tar.xz' are the same file
dpkg-source: warning: extracting unsigned source package (frr_7.2-dev-20190623-00-ga36898e75-0.dsc)
dpkg-source --before-build frr-7.2-dev-20190623-00-ga36898e75
fakeroot debian/rules clean
dpkg-source -b frr-7.2-dev-20190623-00-ga36898e75
dpkg-source: warning: Version number suggests Ubuntu changes, but Maintainer: does not have Ubuntu address
dpkg-source: warning: Version number suggests Ubuntu changes, but there is no XSBC-Original-Maintainer field
debian/rules build
configure.ac:171: installing './compile'
configure.ac:100: installing './missing'
Makefile.am: installing './depcomp'
configure: WARNING: unrecognized options: --disable-maintainer-mode
configure: WARNING: unrecognized options: --disable-maintainer-mode
WARNING: html_favicon is not an .ico file
WARNING: html_static_path entry '/home/ci/cibuild.1/debwork/frr-7.2-dev-20190623-00-ga36898e75/doc/user/_static' does not exist
gcc-5.real: internal compiler error: Segmentation fault (program cc1)
Please submit a full bug report,
with preprocessed source if appropriate.
See <file:///usr/share/doc/gcc-5/README.Bugs> for instructions.
make[1]: *** [tests/lib/tests_lib_cxxcompat-cxxcompat.o] Error 4
make[1]: *** Waiting for unfinished jobs....
dh_auto_test: make -j4 check returned exit code 2
make: *** [build] Error 2
dpkg-buildpackage: error: debian/rules build gave error exit status 2
debian package build (dpkg-buildpackage) failed