Build #1

FreeRangeRouting Protocol Suite

Build: #1 failed First build for this plan

Build result summary

Details

Completed
Duration
188 minutes
Labels
version=frr-7_1-dev-2117-g1c94fda60git=https_//github_com/frrouting/frr_gitbuildurl=https_//ci1_netdef_org/browse/frr-frr45-1branch=revert-4609-fix/show_set_comm-list_delete
Revision
1c94fda60a92bc7e893471382555860ac53e6771 1c94fda60a92bc7e893471382555860ac53e6771
Total tests
8816

Tests

Responsible

No one has taken responsibility for this failure

Tests

New test failures 2
Status Test View job Duration
Collapse Failed test_bgp_basic_functionality test_static_routes History
Topology Tests on Ubuntu 16.04 amd64 5 secs
AssertionError: Testcase test_static_routes :Failed     Error: No bgp route found in rib of router r3.. assert 'No bgp route found in rib of router r3..' is True
E   AssertionError: Testcase test_static_routes :Failed 
       Error: No bgp route found in rib of router r3..
    assert 'No bgp route found in rib of router r3..' is True
Collapse Failed test_bgp_basic_functionality test_static_routes History
Topology Tests on Ubuntu 18.04 amd64 5 secs
AssertionError: Testcase test_static_routes :Failed     Error: No bgp route found in rib of router r3.. assert 'No bgp route found in rib of router r3..' is True
E   AssertionError: Testcase test_static_routes :Failed 
       Error: No bgp route found in rib of router r3..
    assert 'No bgp route found in rib of router r3..' is True