FreeRangeRouting Github Pull Request Testing

Build: #11473 failed Custom build by Github Hook with revision master

Build result summary

Details

Completed
Duration
83 minutes
Flags
Custom revisionCustom build
Labels
version=frr-7_4-dev-746-g09ad1509dgit=https_//github_com/frrouting/frr_gitbuildurl=https_//ci1_netdef_org/browse/frr-frrpullreq-11473branch=master
Revision
11a5527a3eb6a888053620604fb3f1241317e826 11a5527a3eb6a888053620604fb3f1241317e826
Total tests
7326
Fixed in
#11474 (Custom build by Github Hook with revision master)

Tests

Custom variables

Custom revision
11a5527a3eb6a888053620604fb3f1241317e826 11a5527a3eb6a888053620604fb3f1241317e826
Name Value
github_base_sha 11a5527a3eb6a888053620604fb3f1241317e826
github_pullreq 6100
github_repo FRRouting/frr
github_merge_sha 09ad1509d8498770f430696be4e1ed268c436443
github_branch master

Comments

  1. Github Hook

    GitHub Merge Request 6100
    for GitHub Repo FRRouting/frr, branch master

    Request to merge from donaldsharp/frr
    Merge Git Commit ID 09ad1509d8498770f430696be4e1ed268c436443 on top of base Git Commit ID 11a5527a3eb6a888053620604fb3f1241317e826

Code commits

Author Commit Message Commit date
Donald Sharp Donald Sharp 11a5527a3eb6a888053620604fb3f1241317e826 11a5527a3eb6a888053620604fb3f1241317e826 Merge pull request #6084 from sarav511/wrvif_crash
pimd: avoiding crash in wrvifwhole path

Tests

New test failures 121
Status Test View job Duration
Collapse Failed test_all_protocol_startup test_shutdown_check_stderr History
Topology Tests on Ubuntu 18.04 amd64 3 secs
AssertionError:  r1: bgpd crashed. Core file found - Backtrace follows: [New LWP 18646] [New LWP 18665] [New LWP 18666] [New LWP 18667] [Thread debugging using libthread_db enabled] Using host libthread_db library "/lib/x86_64-linux-gnu/libthread_db.so.1". Core was generated by `/usr/lib/frr/bgpd'. Program terminated with signal SIGABRT, Aborted. #0  __GI_raise (sig=sig@entry=6) at ../sysdeps/unix/sysv/linux/raise.c:51 [Current thread is 1 (Thread 0x7ff0fd1c87c0 (LWP 18646))] #0  __GI_raise (sig=sig@entry=6) at ../sysdeps/unix/sysv/linux/raise.c:51 #1  0x00007ff0fc032801 in __GI_abort () at abort.c:79 #2  0x00007ff0fc02239a in __assert_fail_base (fmt=0x7ff0fc1a97d8 "%s%s%s:%u: %s%sAssertion `%s' failed.\n%n", assertion=assertion@entry=0x7ff0fce6ba01 "node->info == NULL", file=file@entry=0x7ff0fce6b9c5 "lib/table.c", line=line@entry=344, function=function@entry=0x7ff0fce6bbf0 "route_node_delete") at assert.c:92 #3  0x00007ff0fc022412 in __GI___assert_fail (assertion=0x7ff0fce6ba01 "node->info == NULL", file=0x7ff0fce6b9c5 "lib/table.c", line=344, function=0x7ff0fce6bbf0 "route_node_delete") at assert.c:101 #4  0x00007ff0fce2f05e in route_node_delete () from /usr/lib/x86_64-linux-gnu/frr/libfrr.so.0 #5  0x00007ff0fce2f0f9 in route_next () from /usr/lib/x86_64-linux-gnu/frr/libfrr.so.0 #6  0x0000564f814f98ba in bgp_static_delete () #7  0x0000564f81546245 in bgp_delete () #8  0x0000564f814ae1ee in sigint () #9  0x00007ff0fce262d3 in quagga_sigevent_process () from /usr/lib/x86_64-linux-gnu/frr/libfrr.so.0 #10 0x00007ff0fce3346d in thread_fetch () from /usr/lib/x86_64-linux-gnu/frr/libfrr.so.0 #11 0x00007ff0fcdfdfe3 in frr_run () from /usr/lib/x86_64-linux-gnu/frr/libfrr.so.0 #12 0x0000564f814abdd1 in main ()
E   AssertionError: 
    r1: bgpd crashed. Core file found - Backtrace follows:
    [New LWP 18646]
    [New LWP 18665]
    [New LWP 18666]
    [New LWP 18667]
    [Thread debugging using libthread_db enabled]
(18 more lines...)
Collapse Failed test_all_protocol_startup test_shutdown_check_stderr History
TopoTest Tests on Ubuntu 16.04 i386 2 secs
AssertionError:  r1: bgpd crashed. Core file found - Backtrace follows: [New LWP 27573] [New LWP 27584] [New LWP 27585] [New LWP 27586] [Thread debugging using libthread_db enabled] Using host libthread_db library "/lib/i386-linux-gnu/libthread_db.so.1". Core was generated by `/usr/lib/frr/bgpd'. Program terminated with signal SIGABRT, Aborted. #0  0xb7f4ecf5 in ?? () [Current thread is 1 (Thread 0xb78877c0 (LWP 27573))] #0  0xb7f4ecf5 in ?? () #1  0xb7ecf957 in route_next () from /usr/lib/i386-linux-gnu/frr/libfrr.so.0 #2  0x00558514 in bgp_static_delete () #3  0x005a504c in bgp_delete () #4  0x0050bb00 in sigint () #5  0xb7ec6761 in quagga_sigevent_process () from /usr/lib/i386-linux-gnu/frr/libfrr.so.0 #6  0xb7ed3f08 in thread_fetch () from /usr/lib/i386-linux-gnu/frr/libfrr.so.0 #7  0xb7e9bdbe in frr_run () from /usr/lib/i386-linux-gnu/frr/libfrr.so.0 #8  0x005095e0 in main ()
E   AssertionError: 
    r1: bgpd crashed. Core file found - Backtrace follows:
    [New LWP 27573]
    [New LWP 27584]
    [New LWP 27585]
    [New LWP 27586]
    [Thread debugging using libthread_db enabled]
(14 more lines...)
Collapse Failed test_all_protocol_startup test_shutdown_check_stderr History
Topology Tests on Ubuntu 16.04 amd64 2 secs
AssertionError:  r1: bgpd crashed. Core file found - Backtrace follows: [New LWP 7355] [New LWP 7368] [New LWP 7367] [New LWP 7366] [Thread debugging using libthread_db enabled] Using host libthread_db library "/lib/x86_64-linux-gnu/libthread_db.so.1". Core was generated by `/usr/lib/frr/bgpd'. Program terminated with signal SIGABRT, Aborted. #0  0x00007ff152856428 in __GI_raise (sig=sig@entry=6) at ../sysdeps/unix/sysv/linux/raise.c:54 [Current thread is 1 (Thread 0x7ff1538b3880 (LWP 7355))] #0  0x00007ff152856428 in __GI_raise (sig=sig@entry=6) at ../sysdeps/unix/sysv/linux/raise.c:54 #1  0x00007ff15285802a in __GI_abort () at abort.c:89 #2  0x00007ff15284ebd7 in __assert_fail_base (fmt=<optimized out>, assertion=assertion@entry=0x7ff1535dc241 "node->info == NULL", file=file@entry=0x7ff1535dc205 "lib/table.c", line=line@entry=344, function=function@entry=0x7ff1535dc430 "route_node_delete") at assert.c:92 #3  0x00007ff15284ec82 in __GI___assert_fail (assertion=0x7ff1535dc241 "node->info == NULL", file=0x7ff1535dc205 "lib/table.c", line=344, function=0x7ff1535dc430 "route_node_delete") at assert.c:101 #4  0x00007ff15359fbfd in route_node_delete () from /usr/lib/x86_64-linux-gnu/frr/libfrr.so.0 #5  0x00007ff15359fcb1 in route_next () from /usr/lib/x86_64-linux-gnu/frr/libfrr.so.0 #6  0x000055a85fc91afc in bgp_static_delete () #7  0x000055a85fcdd735 in bgp_delete () #8  0x000055a85fc47228 in sigint () #9  0x00007ff153596d53 in quagga_sigevent_process () from /usr/lib/x86_64-linux-gnu/frr/libfrr.so.0 #10 0x00007ff1535a41cd in thread_fetch () from /usr/lib/x86_64-linux-gnu/frr/libfrr.so.0 #11 0x00007ff15356e893 in frr_run () from /usr/lib/x86_64-linux-gnu/frr/libfrr.so.0 #12 0x000055a85fc44e01 in main ()
E   AssertionError: 
    r1: bgpd crashed. Core file found - Backtrace follows:
    [New LWP 7355]
    [New LWP 7368]
    [New LWP 7367]
    [New LWP 7366]
    [Thread debugging using libthread_db enabled]
(18 more lines...)
Collapse Failed test_bfd_bgp_cbit_topo3 test_memory_leak History
Topology Tests on Ubuntu 16.04 amd64 3 secs
AssertionError:  r1: bgpd crashed. Core file found - Backtrace follows: [New LWP 8138] [New LWP 8143] [New LWP 8142] [New LWP 8144] [Thread debugging using libthread_db enabled] Using host libthread_db library "/lib/x86_64-linux-gnu/libthread_db.so.1". Core was generated by `/usr/lib/frr/bgpd'. Program terminated with signal SIGABRT, Aborted. #0  0x00007fc3f3c03428 in __GI_raise (sig=sig@entry=6) at ../sysdeps/unix/sysv/linux/raise.c:54 [Current thread is 1 (Thread 0x7fc3f4c60880 (LWP 8138))] #0  0x00007fc3f3c03428 in __GI_raise (sig=sig@entry=6) at ../sysdeps/unix/sysv/linux/raise.c:54 #1  0x00007fc3f3c0502a in __GI_abort () at abort.c:89 #2  0x00007fc3f3bfbbd7 in __assert_fail_base (fmt=<optimized out>, assertion=assertion@entry=0x7fc3f4989241 "node->info == NULL", file=file@entry=0x7fc3f4989205 "lib/table.c", line=line@entry=344, function=function@entry=0x7fc3f4989430 "route_node_delete") at assert.c:92 #3  0x00007fc3f3bfbc82 in __GI___assert_fail (assertion=0x7fc3f4989241 "node->info == NULL", file=0x7fc3f4989205 "lib/table.c", line=344, function=0x7fc3f4989430 "route_node_delete") at assert.c:101 #4  0x00007fc3f494cbfd in route_node_delete () from /usr/lib/x86_64-linux-gnu/frr/libfrr.so.0 #5  0x00007fc3f494ccb1 in route_next () from /usr/lib/x86_64-linux-gnu/frr/libfrr.so.0 #6  0x0000557aabfdbafc in bgp_static_delete () #7  0x0000557aac027735 in bgp_delete () #8  0x0000557aabf91228 in sigint () #9  0x00007fc3f4943d53 in quagga_sigevent_process () from /usr/lib/x86_64-linux-gnu/frr/libfrr.so.0 #10 0x00007fc3f49511cd in thread_fetch () from /usr/lib/x86_64-linux-gnu/frr/libfrr.so.0 #11 0x00007fc3f491b893 in frr_run () from /usr/lib/x86_64-linux-gnu/frr/libfrr.so.0 #12 0x0000557aabf8ee01 in main ()
E   AssertionError: 
    r1: bgpd crashed. Core file found - Backtrace follows:
    [New LWP 8138]
    [New LWP 8143]
    [New LWP 8142]
    [New LWP 8144]
    [Thread debugging using libthread_db enabled]
(18 more lines...)
Collapse Failed test_bfd_bgp_cbit_topo3 test_memory_leak History
TopoTest Tests on Ubuntu 16.04 i386 3 secs
AssertionError:  r1: bgpd crashed. Core file found - Backtrace follows: [New LWP 28406] [New LWP 28410] [New LWP 28411] [New LWP 28412] [Thread debugging using libthread_db enabled] Using host libthread_db library "/lib/i386-linux-gnu/libthread_db.so.1". Core was generated by `/usr/lib/frr/bgpd'. Program terminated with signal SIGABRT, Aborted. #0  0xb7f86cf5 in ?? () [Current thread is 1 (Thread 0xb78bf7c0 (LWP 28406))] #0  0xb7f86cf5 in ?? () #1  0xb7f07957 in route_next () from /usr/lib/i386-linux-gnu/frr/libfrr.so.0 #2  0x00548514 in bgp_static_delete () #3  0x0059504c in bgp_delete () #4  0x004fbb00 in sigint () #5  0xb7efe761 in quagga_sigevent_process () from /usr/lib/i386-linux-gnu/frr/libfrr.so.0 #6  0xb7f0bf08 in thread_fetch () from /usr/lib/i386-linux-gnu/frr/libfrr.so.0 #7  0xb7ed3dbe in frr_run () from /usr/lib/i386-linux-gnu/frr/libfrr.so.0 #8  0x004f95e0 in main ()
E   AssertionError: 
    r1: bgpd crashed. Core file found - Backtrace follows:
    [New LWP 28406]
    [New LWP 28410]
    [New LWP 28411]
    [New LWP 28412]
    [Thread debugging using libthread_db enabled]
(14 more lines...)
Collapse Failed test_bfd_bgp_cbit_topo3 test_memory_leak History
Topology Tests on Ubuntu 18.04 amd64 3 secs
AssertionError:  r1: bgpd crashed. Core file found - Backtrace follows: [New LWP 19276] [New LWP 19280] [New LWP 19282] [New LWP 19281] [Thread debugging using libthread_db enabled] Using host libthread_db library "/lib/x86_64-linux-gnu/libthread_db.so.1". Core was generated by `/usr/lib/frr/bgpd'. Program terminated with signal SIGABRT, Aborted. #0  __GI_raise (sig=sig@entry=6) at ../sysdeps/unix/sysv/linux/raise.c:51 [Current thread is 1 (Thread 0x7f0f32ea37c0 (LWP 19276))] #0  __GI_raise (sig=sig@entry=6) at ../sysdeps/unix/sysv/linux/raise.c:51 #1  0x00007f0f31d0d801 in __GI_abort () at abort.c:79 #2  0x00007f0f31cfd39a in __assert_fail_base (fmt=0x7f0f31e847d8 "%s%s%s:%u: %s%sAssertion `%s' failed.\n%n", assertion=assertion@entry=0x7f0f32b46a01 "node->info == NULL", file=file@entry=0x7f0f32b469c5 "lib/table.c", line=line@entry=344, function=function@entry=0x7f0f32b46bf0 "route_node_delete") at assert.c:92 #3  0x00007f0f31cfd412 in __GI___assert_fail (assertion=0x7f0f32b46a01 "node->info == NULL", file=0x7f0f32b469c5 "lib/table.c", line=344, function=0x7f0f32b46bf0 "route_node_delete") at assert.c:101 #4  0x00007f0f32b0a05e in route_node_delete () from /usr/lib/x86_64-linux-gnu/frr/libfrr.so.0 #5  0x00007f0f32b0a0f9 in route_next () from /usr/lib/x86_64-linux-gnu/frr/libfrr.so.0 #6  0x0000560ee18a18ba in bgp_static_delete () #7  0x0000560ee18ee245 in bgp_delete () #8  0x0000560ee18561ee in sigint () #9  0x00007f0f32b012d3 in quagga_sigevent_process () from /usr/lib/x86_64-linux-gnu/frr/libfrr.so.0 #10 0x00007f0f32b0e46d in thread_fetch () from /usr/lib/x86_64-linux-gnu/frr/libfrr.so.0 #11 0x00007f0f32ad8fe3 in frr_run () from /usr/lib/x86_64-linux-gnu/frr/libfrr.so.0 #12 0x0000560ee1853dd1 in main ()
E   AssertionError: 
    r1: bgpd crashed. Core file found - Backtrace follows:
    [New LWP 19276]
    [New LWP 19280]
    [New LWP 19282]
    [New LWP 19281]
    [Thread debugging using libthread_db enabled]
(18 more lines...)
Collapse Failed test_bfd_topo1 test_memory_leak History
TopoTest Tests on Ubuntu 16.04 i386 3 secs
AssertionError:  r4: bgpd crashed. Core file found - Backtrace follows: [New LWP 29170] [New LWP 29174] [New LWP 29175] [New LWP 29176] [Thread debugging using libthread_db enabled] Using host libthread_db library "/lib/i386-linux-gnu/libthread_db.so.1". Core was generated by `/usr/lib/frr/bgpd'. Program terminated with signal SIGABRT, Aborted. #0  0xb7f4bcf5 in ?? () [Current thread is 1 (Thread 0xb78847c0 (LWP 29170))] #0  0xb7f4bcf5 in ?? () #1  0xb7ecc957 in route_next () from /usr/lib/i386-linux-gnu/frr/libfrr.so.0 #2  0x004da514 in bgp_static_delete () #3  0x0052704c in bgp_delete () #4  0x0048db00 in sigint () #5  0xb7ec3761 in quagga_sigevent_process () from /usr/lib/i386-linux-gnu/frr/libfrr.so.0 #6  0xb7ed0f08 in thread_fetch () from /usr/lib/i386-linux-gnu/frr/libfrr.so.0 #7  0xb7e98dbe in frr_run () from /usr/lib/i386-linux-gnu/frr/libfrr.so.0 #8  0x0048b5e0 in main ()
E   AssertionError: 
    r4: bgpd crashed. Core file found - Backtrace follows:
    [New LWP 29170]
    [New LWP 29174]
    [New LWP 29175]
    [New LWP 29176]
    [Thread debugging using libthread_db enabled]
(14 more lines...)
Collapse Failed test_bfd_topo1 test_memory_leak History
Topology Tests on Ubuntu 18.04 amd64 3 secs
AssertionError:  r4: bgpd crashed. Core file found - Backtrace follows: [New LWP 19927] [New LWP 19931] [New LWP 19932] [New LWP 19933] [Thread debugging using libthread_db enabled] Using host libthread_db library "/lib/x86_64-linux-gnu/libthread_db.so.1". Core was generated by `/usr/lib/frr/bgpd'. Program terminated with signal SIGABRT, Aborted. #0  __GI_raise (sig=sig@entry=6) at ../sysdeps/unix/sysv/linux/raise.c:51 [Current thread is 1 (Thread 0x7f74582b17c0 (LWP 19927))] #0  __GI_raise (sig=sig@entry=6) at ../sysdeps/unix/sysv/linux/raise.c:51 #1  0x00007f745711b801 in __GI_abort () at abort.c:79 #2  0x00007f745710b39a in __assert_fail_base (fmt=0x7f74572927d8 "%s%s%s:%u: %s%sAssertion `%s' failed.\n%n", assertion=assertion@entry=0x7f7457f54a01 "node->info == NULL", file=file@entry=0x7f7457f549c5 "lib/table.c", line=line@entry=344, function=function@entry=0x7f7457f54bf0 "route_node_delete") at assert.c:92 #3  0x00007f745710b412 in __GI___assert_fail (assertion=0x7f7457f54a01 "node->info == NULL", file=0x7f7457f549c5 "lib/table.c", line=344, function=0x7f7457f54bf0 "route_node_delete") at assert.c:101 #4  0x00007f7457f1805e in route_node_delete () from /usr/lib/x86_64-linux-gnu/frr/libfrr.so.0 #5  0x00007f7457f180f9 in route_next () from /usr/lib/x86_64-linux-gnu/frr/libfrr.so.0 #6  0x00005620dd8268ba in bgp_static_delete () #7  0x00005620dd873245 in bgp_delete () #8  0x00005620dd7db1ee in sigint () #9  0x00007f7457f0f2d3 in quagga_sigevent_process () from /usr/lib/x86_64-linux-gnu/frr/libfrr.so.0 #10 0x00007f7457f1c46d in thread_fetch () from /usr/lib/x86_64-linux-gnu/frr/libfrr.so.0 #11 0x00007f7457ee6fe3 in frr_run () from /usr/lib/x86_64-linux-gnu/frr/libfrr.so.0 #12 0x00005620dd7d8dd1 in main ()
E   AssertionError: 
    r4: bgpd crashed. Core file found - Backtrace follows:
    [New LWP 19927]
    [New LWP 19931]
    [New LWP 19932]
    [New LWP 19933]
    [Thread debugging using libthread_db enabled]
(18 more lines...)
Collapse Failed test_bfd_topo1 test_memory_leak History
Topology Tests on Ubuntu 16.04 amd64 3 secs
AssertionError:  r4: bgpd crashed. Core file found - Backtrace follows: [New LWP 8922] [New LWP 8926] [New LWP 8927] [New LWP 8928] [Thread debugging using libthread_db enabled] Using host libthread_db library "/lib/x86_64-linux-gnu/libthread_db.so.1". Core was generated by `/usr/lib/frr/bgpd'. Program terminated with signal SIGABRT, Aborted. #0  0x00007f5e14108428 in __GI_raise (sig=sig@entry=6) at ../sysdeps/unix/sysv/linux/raise.c:54 [Current thread is 1 (Thread 0x7f5e15165880 (LWP 8922))] #0  0x00007f5e14108428 in __GI_raise (sig=sig@entry=6) at ../sysdeps/unix/sysv/linux/raise.c:54 #1  0x00007f5e1410a02a in __GI_abort () at abort.c:89 #2  0x00007f5e14100bd7 in __assert_fail_base (fmt=<optimized out>, assertion=assertion@entry=0x7f5e14e8e241 "node->info == NULL", file=file@entry=0x7f5e14e8e205 "lib/table.c", line=line@entry=344, function=function@entry=0x7f5e14e8e430 "route_node_delete") at assert.c:92 #3  0x00007f5e14100c82 in __GI___assert_fail (assertion=0x7f5e14e8e241 "node->info == NULL", file=0x7f5e14e8e205 "lib/table.c", line=344, function=0x7f5e14e8e430 "route_node_delete") at assert.c:101 #4  0x00007f5e14e51bfd in route_node_delete () from /usr/lib/x86_64-linux-gnu/frr/libfrr.so.0 #5  0x00007f5e14e51cb1 in route_next () from /usr/lib/x86_64-linux-gnu/frr/libfrr.so.0 #6  0x000055e91475fafc in bgp_static_delete () #7  0x000055e9147ab735 in bgp_delete () #8  0x000055e914715228 in sigint () #9  0x00007f5e14e48d53 in quagga_sigevent_process () from /usr/lib/x86_64-linux-gnu/frr/libfrr.so.0 #10 0x00007f5e14e561cd in thread_fetch () from /usr/lib/x86_64-linux-gnu/frr/libfrr.so.0 #11 0x00007f5e14e20893 in frr_run () from /usr/lib/x86_64-linux-gnu/frr/libfrr.so.0 #12 0x000055e914712e01 in main ()
E   AssertionError: 
    r4: bgpd crashed. Core file found - Backtrace follows:
    [New LWP 8922]
    [New LWP 8926]
    [New LWP 8927]
    [New LWP 8928]
    [Thread debugging using libthread_db enabled]
(18 more lines...)
Collapse Failed test_bfd_topo2 test_memory_leak History
Topology Tests on Ubuntu 18.04 amd64 5 secs
AssertionError:  r1: bgpd crashed. Core file found - Backtrace follows: [New LWP 20825] [New LWP 20833] [New LWP 20831] [New LWP 20832] [Thread debugging using libthread_db enabled] Using host libthread_db library "/lib/x86_64-linux-gnu/libthread_db.so.1". Core was generated by `/usr/lib/frr/bgpd'. Program terminated with signal SIGABRT, Aborted. #0  __GI_raise (sig=sig@entry=6) at ../sysdeps/unix/sysv/linux/raise.c:51 [Current thread is 1 (Thread 0x7efc72eaf7c0 (LWP 20825))] #0  __GI_raise (sig=sig@entry=6) at ../sysdeps/unix/sysv/linux/raise.c:51 #1  0x00007efc71d19801 in __GI_abort () at abort.c:79 #2  0x00007efc71d0939a in __assert_fail_base (fmt=0x7efc71e907d8 "%s%s%s:%u: %s%sAssertion `%s' failed.\n%n", assertion=assertion@entry=0x7efc72b52a01 "node->info == NULL", file=file@entry=0x7efc72b529c5 "lib/table.c", line=line@entry=344, function=function@entry=0x7efc72b52bf0 "route_node_delete") at assert.c:92 #3  0x00007efc71d09412 in __GI___assert_fail (assertion=0x7efc72b52a01 "node->info == NULL", file=0x7efc72b529c5 "lib/table.c", line=344, function=0x7efc72b52bf0 "route_node_delete") at assert.c:101 #4  0x00007efc72b1605e in route_node_delete () from /usr/lib/x86_64-linux-gnu/frr/libfrr.so.0 #5  0x00007efc72b160f9 in route_next () from /usr/lib/x86_64-linux-gnu/frr/libfrr.so.0 #6  0x000055dad5f465de in ?? () #7  0x000055dad5f4bf4b in bgp_clear_route () #8  0x000055dad5f4c110 in bgp_clear_route_all () #9  0x000055dad5f2882c in bgp_fsm_change_status () #10 0x000055dad5f9c7fb in peer_delete () #11 0x000055dad5f9ebac in peer_group_delete () #12 0x000055dad5f9f2a5 in bgp_delete () #13 0x000055dad5f071ee in sigint () #14 0x00007efc72b0d2d3 in quagga_sigevent_process () from /usr/lib/x86_64-linux-gnu/frr/libfrr.so.0 #15 0x00007efc72b1a46d in thread_fetch () from /usr/lib/x86_64-linux-gnu/frr/libfrr.so.0 #16 0x00007efc72ae4fe3 in frr_run () from /usr/lib/x86_64-linux-gnu/frr/libfrr.so.0 #17 0x000055dad5f04dd1 in main ()
E   AssertionError: 
    r1: bgpd crashed. Core file found - Backtrace follows:
    [New LWP 20825]
    [New LWP 20833]
    [New LWP 20831]
    [New LWP 20832]
    [Thread debugging using libthread_db enabled]
(23 more lines...)
Collapse Failed test_bfd_topo2 test_memory_leak History
TopoTest Tests on Ubuntu 16.04 i386 5 secs
AssertionError:  r1: bgpd crashed. Core file found - Backtrace follows: [New LWP 30226] [New LWP 30234] [New LWP 30232] [New LWP 30233] [Thread debugging using libthread_db enabled] Using host libthread_db library "/lib/i386-linux-gnu/libthread_db.so.1". Core was generated by `/usr/lib/frr/bgpd'. Program terminated with signal SIGABRT, Aborted. #0  0xb7f89cf5 in ?? () [Current thread is 1 (Thread 0xb78c27c0 (LWP 30226))] #0  0xb7f89cf5 in ?? () #1  0xb7f0a957 in route_next () from /usr/lib/i386-linux-gnu/frr/libfrr.so.0 #2  0x004ce9bf in ?? () #3  0x004d3c08 in bgp_clear_route () #4  0x004d3db6 in bgp_clear_route_all () #5  0x004afe83 in bgp_fsm_change_status () #6  0x00524c95 in peer_delete () #7  0x00526988 in peer_group_delete () #8  0x005270c6 in bgp_delete () #9  0x0048db00 in sigint () #10 0xb7f01761 in quagga_sigevent_process () from /usr/lib/i386-linux-gnu/frr/libfrr.so.0 #11 0xb7f0ef08 in thread_fetch () from /usr/lib/i386-linux-gnu/frr/libfrr.so.0 #12 0xb7ed6dbe in frr_run () from /usr/lib/i386-linux-gnu/frr/libfrr.so.0 #13 0x0048b5e0 in main ()
E   AssertionError: 
    r1: bgpd crashed. Core file found - Backtrace follows:
    [New LWP 30226]
    [New LWP 30234]
    [New LWP 30232]
    [New LWP 30233]
    [Thread debugging using libthread_db enabled]
(19 more lines...)
Collapse Failed test_bfd_topo2 test_memory_leak History
Topology Tests on Ubuntu 16.04 amd64 5 secs
AssertionError:  r1: bgpd crashed. Core file found - Backtrace follows: [New LWP 9955] [New LWP 9962] [New LWP 9960] [New LWP 9961] [Thread debugging using libthread_db enabled] Using host libthread_db library "/lib/x86_64-linux-gnu/libthread_db.so.1". Core was generated by `/usr/lib/frr/bgpd'. Program terminated with signal SIGABRT, Aborted. #0  0x00007f34bd7f7428 in __GI_raise (sig=sig@entry=6) at ../sysdeps/unix/sysv/linux/raise.c:54 [Current thread is 1 (Thread 0x7f34be854880 (LWP 9955))] #0  0x00007f34bd7f7428 in __GI_raise (sig=sig@entry=6) at ../sysdeps/unix/sysv/linux/raise.c:54 #1  0x00007f34bd7f902a in __GI_abort () at abort.c:89 #2  0x00007f34bd7efbd7 in __assert_fail_base (fmt=<optimized out>, assertion=assertion@entry=0x7f34be57d241 "node->info == NULL", file=file@entry=0x7f34be57d205 "lib/table.c", line=line@entry=344, function=function@entry=0x7f34be57d430 "route_node_delete") at assert.c:92 #3  0x00007f34bd7efc82 in __GI___assert_fail (assertion=0x7f34be57d241 "node->info == NULL", file=0x7f34be57d205 "lib/table.c", line=344, function=0x7f34be57d430 "route_node_delete") at assert.c:101 #4  0x00007f34be540bfd in route_node_delete () from /usr/lib/x86_64-linux-gnu/frr/libfrr.so.0 #5  0x00007f34be540cb1 in route_next () from /usr/lib/x86_64-linux-gnu/frr/libfrr.so.0 #6  0x0000556290cc7e39 in ?? () #7  0x0000556290ccd35c in bgp_clear_route () #8  0x0000556290ccd510 in bgp_clear_route_all () #9  0x0000556290caa20c in bgp_fsm_change_status () #10 0x0000556290d1cdbb in peer_delete () #11 0x0000556290d1f0c1 in peer_group_delete () #12 0x0000556290d1f795 in bgp_delete () #13 0x0000556290c89228 in sigint () #14 0x00007f34be537d53 in quagga_sigevent_process () from /usr/lib/x86_64-linux-gnu/frr/libfrr.so.0 #15 0x00007f34be5451cd in thread_fetch () from /usr/lib/x86_64-linux-gnu/frr/libfrr.so.0 #16 0x00007f34be50f893 in frr_run () from /usr/lib/x86_64-linux-gnu/frr/libfrr.so.0 #17 0x0000556290c86e01 in main ()
E   AssertionError: 
    r1: bgpd crashed. Core file found - Backtrace follows:
    [New LWP 9955]
    [New LWP 9962]
    [New LWP 9960]
    [New LWP 9961]
    [Thread debugging using libthread_db enabled]
(23 more lines...)
Collapse Failed test_bfd_vrf_topo1 test_memory_leak History
Topology Tests on Ubuntu 18.04 amd64 3 secs
AssertionError:  r4: bgpd crashed. Core file found - Backtrace follows: [New LWP 21900] [New LWP 21904] [New LWP 21906] [New LWP 21905] [Thread debugging using libthread_db enabled] Using host libthread_db library "/lib/x86_64-linux-gnu/libthread_db.so.1". Core was generated by `/usr/lib/frr/bgpd'. Program terminated with signal SIGABRT, Aborted. #0  __GI_raise (sig=sig@entry=6) at ../sysdeps/unix/sysv/linux/raise.c:51 [Current thread is 1 (Thread 0x7f3ac0f6f7c0 (LWP 21900))] #0  __GI_raise (sig=sig@entry=6) at ../sysdeps/unix/sysv/linux/raise.c:51 #1  0x00007f3abfdd9801 in __GI_abort () at abort.c:79 #2  0x00007f3abfdc939a in __assert_fail_base (fmt=0x7f3abff507d8 "%s%s%s:%u: %s%sAssertion `%s' failed.\n%n", assertion=assertion@entry=0x7f3ac0c12a01 "node->info == NULL", file=file@entry=0x7f3ac0c129c5 "lib/table.c", line=line@entry=344, function=function@entry=0x7f3ac0c12bf0 "route_node_delete") at assert.c:92 #3  0x00007f3abfdc9412 in __GI___assert_fail (assertion=0x7f3ac0c12a01 "node->info == NULL", file=0x7f3ac0c129c5 "lib/table.c", line=344, function=0x7f3ac0c12bf0 "route_node_delete") at assert.c:101 #4  0x00007f3ac0bd605e in route_node_delete () from /usr/lib/x86_64-linux-gnu/frr/libfrr.so.0 #5  0x00007f3ac0bd60f9 in route_next () from /usr/lib/x86_64-linux-gnu/frr/libfrr.so.0 #6  0x0000555f77ff78ba in bgp_static_delete () #7  0x0000555f78044245 in bgp_delete () #8  0x0000555f77fac1a2 in sigint () #9  0x00007f3ac0bcd2d3 in quagga_sigevent_process () from /usr/lib/x86_64-linux-gnu/frr/libfrr.so.0 #10 0x00007f3ac0bda46d in thread_fetch () from /usr/lib/x86_64-linux-gnu/frr/libfrr.so.0 #11 0x00007f3ac0ba4fe3 in frr_run () from /usr/lib/x86_64-linux-gnu/frr/libfrr.so.0 #12 0x0000555f77fa9dd1 in main ()
E   AssertionError: 
    r4: bgpd crashed. Core file found - Backtrace follows:
    [New LWP 21900]
    [New LWP 21904]
    [New LWP 21906]
    [New LWP 21905]
    [Thread debugging using libthread_db enabled]
(18 more lines...)
Collapse Failed test_bfd_vrf_topo1 test_memory_leak History
TopoTest Tests on Ubuntu 16.04 i386 3 secs
AssertionError:  r4: bgpd crashed. Core file found - Backtrace follows: [New LWP 31437] [New LWP 31441] [New LWP 31442] [New LWP 31443] [Thread debugging using libthread_db enabled] Using host libthread_db library "/lib/i386-linux-gnu/libthread_db.so.1". Core was generated by `/usr/lib/frr/bgpd'. Program terminated with signal SIGABRT, Aborted. #0  0xb7f49cf5 in ?? () [Current thread is 1 (Thread 0xb78827c0 (LWP 31437))] #0  0xb7f49cf5 in ?? () #1  0xb7eca957 in route_next () from /usr/lib/i386-linux-gnu/frr/libfrr.so.0 #2  0x004c9514 in bgp_static_delete () #3  0x0051604c in bgp_delete () #4  0x0047cad5 in sigint () #5  0xb7ec1761 in quagga_sigevent_process () from /usr/lib/i386-linux-gnu/frr/libfrr.so.0 #6  0xb7ecef08 in thread_fetch () from /usr/lib/i386-linux-gnu/frr/libfrr.so.0 #7  0xb7e96dbe in frr_run () from /usr/lib/i386-linux-gnu/frr/libfrr.so.0 #8  0x0047a5e0 in main ()
E   AssertionError: 
    r4: bgpd crashed. Core file found - Backtrace follows:
    [New LWP 31437]
    [New LWP 31441]
    [New LWP 31442]
    [New LWP 31443]
    [Thread debugging using libthread_db enabled]
(14 more lines...)
Collapse Failed test_bfd_vrf_topo1 test_memory_leak History
Topology Tests on Ubuntu 16.04 amd64 3 secs
AssertionError:  r4: bgpd crashed. Core file found - Backtrace follows: [New LWP 11159] [New LWP 11165] [New LWP 11164] [New LWP 11163] [Thread debugging using libthread_db enabled] Using host libthread_db library "/lib/x86_64-linux-gnu/libthread_db.so.1". Core was generated by `/usr/lib/frr/bgpd'. Program terminated with signal SIGABRT, Aborted. #0  0x00007f0203d4e428 in __GI_raise (sig=sig@entry=6) at ../sysdeps/unix/sysv/linux/raise.c:54 [Current thread is 1 (Thread 0x7f0204dab880 (LWP 11159))] #0  0x00007f0203d4e428 in __GI_raise (sig=sig@entry=6) at ../sysdeps/unix/sysv/linux/raise.c:54 #1  0x00007f0203d5002a in __GI_abort () at abort.c:89 #2  0x00007f0203d46bd7 in __assert_fail_base (fmt=<optimized out>, assertion=assertion@entry=0x7f0204ad4241 "node->info == NULL", file=file@entry=0x7f0204ad4205 "lib/table.c", line=line@entry=344, function=function@entry=0x7f0204ad4430 "route_node_delete") at assert.c:92 #3  0x00007f0203d46c82 in __GI___assert_fail (assertion=0x7f0204ad4241 "node->info == NULL", file=0x7f0204ad4205 "lib/table.c", line=344, function=0x7f0204ad4430 "route_node_delete") at assert.c:101 #4  0x00007f0204a97bfd in route_node_delete () from /usr/lib/x86_64-linux-gnu/frr/libfrr.so.0 #5  0x00007f0204a97cb1 in route_next () from /usr/lib/x86_64-linux-gnu/frr/libfrr.so.0 #6  0x000055d8b0b3fafc in bgp_static_delete () #7  0x000055d8b0b8b735 in bgp_delete () #8  0x000055d8b0af5204 in sigint () #9  0x00007f0204a8ed53 in quagga_sigevent_process () from /usr/lib/x86_64-linux-gnu/frr/libfrr.so.0 #10 0x00007f0204a9c1cd in thread_fetch () from /usr/lib/x86_64-linux-gnu/frr/libfrr.so.0 #11 0x00007f0204a66893 in frr_run () from /usr/lib/x86_64-linux-gnu/frr/libfrr.so.0 #12 0x000055d8b0af2e01 in main ()
E   AssertionError: 
    r4: bgpd crashed. Core file found - Backtrace follows:
    [New LWP 11159]
    [New LWP 11165]
    [New LWP 11164]
    [New LWP 11163]
    [Thread debugging using libthread_db enabled]
(18 more lines...)
Collapse Failed test_bgp_aggregate-address_origin test_bgp_aggregate_address_origin History
Topology Tests on Ubuntu 16.04 amd64 7 secs
test teardown failure
E   AssertionError: 
    r1: bgpd crashed. Core file found - Backtrace follows:
    [New LWP 30195]
    [New LWP 30198]
    [New LWP 30200]
    [New LWP 30199]
    [Thread debugging using libthread_db enabled]
(22 more lines...)
Collapse Failed test_bgp_aggregate-address_origin test_bgp_aggregate_address_origin History
Topology Tests on Ubuntu 18.04 amd64 7 secs
test teardown failure
E   AssertionError: 
    r1: bgpd crashed. Core file found - Backtrace follows:
    [New LWP 7918]
    [New LWP 7921]
    [New LWP 7922]
    [New LWP 7923]
    [Thread debugging using libthread_db enabled]
(22 more lines...)
Collapse Failed test_bgp_aggregate-address_origin test_bgp_aggregate_address_origin History
TopoTest Tests on Ubuntu 16.04 i386 7 secs
test teardown failure
E   AssertionError: 
    r1: bgpd crashed. Core file found - Backtrace follows:
    [New LWP 18025]
    [New LWP 18029]
    [New LWP 18028]
    [New LWP 18030]
    [Thread debugging using libthread_db enabled]
(18 more lines...)
Collapse Failed test_bgp_aggregate-address_route-map test_bgp_maximum_prefix_invalid History
Topology Tests on Ubuntu 18.04 amd64 9 secs
test teardown failure
E   AssertionError: 
    r1: bgpd crashed. Core file found - Backtrace follows:
    [New LWP 8211]
    [New LWP 8214]
    [New LWP 8216]
    [New LWP 8215]
    [Thread debugging using libthread_db enabled]
(22 more lines...)
Collapse Failed test_bgp_aggregate-address_route-map test_bgp_maximum_prefix_invalid History
Topology Tests on Ubuntu 16.04 amd64 8 secs
test teardown failure
E   AssertionError: 
    r1: bgpd crashed. Core file found - Backtrace follows:
    [New LWP 30538]
    [New LWP 30542]
    [New LWP 30541]
    [New LWP 30543]
    [Thread debugging using libthread_db enabled]
(22 more lines...)
Collapse Failed test_bgp_aggregate-address_route-map test_bgp_maximum_prefix_invalid History
TopoTest Tests on Ubuntu 16.04 i386 9 secs
test teardown failure
E   AssertionError: 
    r1: bgpd crashed. Core file found - Backtrace follows:
    [New LWP 18364]
    [New LWP 18367]
    [New LWP 18369]
    [New LWP 18368]
    [Thread debugging using libthread_db enabled]
(18 more lines...)
Collapse Failed test_bgp_comm-list_delete test_bgp_maximum_prefix_invalid History
Topology Tests on Ubuntu 18.04 amd64 10 secs
test teardown failure
E   AssertionError: 
    r1: bgpd crashed. Core file found - Backtrace follows:
    [New LWP 8518]
    [New LWP 8521]
    [New LWP 8523]
    [New LWP 8522]
    [Thread debugging using libthread_db enabled]
(22 more lines...)
Collapse Failed test_bgp_comm-list_delete test_bgp_maximum_prefix_invalid History
TopoTest Tests on Ubuntu 16.04 i386 12 secs
test teardown failure
E   AssertionError: 
    r1: bgpd crashed. Core file found - Backtrace follows:
    [New LWP 18713]
    [New LWP 18716]
    [New LWP 18718]
    [New LWP 18717]
    [Thread debugging using libthread_db enabled]
(18 more lines...)
Collapse Failed test_bgp_comm-list_delete test_bgp_maximum_prefix_invalid History
Topology Tests on Ubuntu 16.04 amd64 10 secs
test teardown failure
E   AssertionError: 
    r1: bgpd crashed. Core file found - Backtrace follows:
    [New LWP 30879]
    [New LWP 30882]
    [New LWP 30884]
    [New LWP 30883]
    [Thread debugging using libthread_db enabled]
(22 more lines...)
Collapse Failed test_bgp_default-originate_route-map test_bgp_default_originate_route_map History
TopoTest Tests on Ubuntu 16.04 i386 9 secs
test teardown failure
E   AssertionError: 
    r2: bgpd crashed. Core file found - Backtrace follows:
    [New LWP 19190]
    [New LWP 19194]
    [New LWP 19195]
    [New LWP 19193]
    [Thread debugging using libthread_db enabled]
(18 more lines...)
Collapse Failed test_bgp_default-originate_route-map test_bgp_default_originate_route_map History
Topology Tests on Ubuntu 18.04 amd64 9 secs
test teardown failure
E   AssertionError: 
    r2: bgpd crashed. Core file found - Backtrace follows:
    [New LWP 8968]
    [New LWP 8971]
    [New LWP 8973]
    [New LWP 8972]
    [Thread debugging using libthread_db enabled]
(22 more lines...)
Collapse Failed test_bgp_default-originate_route-map test_bgp_default_originate_route_map History
Topology Tests on Ubuntu 16.04 amd64 8 secs
test teardown failure
E   AssertionError: 
    r2: bgpd crashed. Core file found - Backtrace follows:
    [New LWP 31368]
    [New LWP 31372]
    [New LWP 31373]
    [New LWP 31371]
    [Thread debugging using libthread_db enabled]
(22 more lines...)
Collapse Failed test_bgp_distance_change test_bgp_maximum_prefix_invalid History
Topology Tests on Ubuntu 16.04 amd64 8 secs
test teardown failure
E   AssertionError: 
    r1: bgpd crashed. Core file found - Backtrace follows:
    [New LWP 31668]
    [New LWP 31673]
    [New LWP 31671]
    [New LWP 31672]
    [Thread debugging using libthread_db enabled]
(51 more lines...)
Collapse Failed test_bgp_distance_change test_bgp_maximum_prefix_invalid History
Topology Tests on Ubuntu 18.04 amd64 8 secs
test teardown failure
E   AssertionError: 
    r1: bgpd crashed. Core file found - Backtrace follows:
    [New LWP 9221]
    [New LWP 9224]
    [New LWP 9226]
    [New LWP 9225]
    [Thread debugging using libthread_db enabled]
(51 more lines...)
Collapse Failed test_bgp_distance_change test_bgp_maximum_prefix_invalid History
TopoTest Tests on Ubuntu 16.04 i386 7 secs
test teardown failure
E   AssertionError: 
    r1: bgpd crashed. Core file found - Backtrace follows:
    [New LWP 19493]
    [New LWP 19496]
    [New LWP 19497]
    [New LWP 19498]
    [Thread debugging using libthread_db enabled]
(43 more lines...)
Collapse Failed test_bgp_ebgp_requires_policy test_ebgp_requires_policy History
TopoTest Tests on Ubuntu 16.04 i386 53 secs
test teardown failure
E   AssertionError: 
    r5: bgpd crashed. Core file found - Backtrace follows:
    [New LWP 20127]
    [New LWP 20130]
    [New LWP 20131]
    [New LWP 20132]
    [Thread debugging using libthread_db enabled]
(68 more lines...)
Collapse Failed test_bgp_ebgp_requires_policy test_ebgp_requires_policy History
Topology Tests on Ubuntu 16.04 amd64 52 secs
test teardown failure
E   AssertionError: 
    r5: bgpd crashed. Core file found - Backtrace follows:
    [New LWP 32295]
    [New LWP 32298]
    [New LWP 32300]
    [New LWP 32299]
    [Thread debugging using libthread_db enabled]
(80 more lines...)
Collapse Failed test_bgp_ebgp_requires_policy test_ebgp_requires_policy History
Topology Tests on Ubuntu 18.04 amd64 52 secs
test teardown failure
E   AssertionError: 
    r5: bgpd crashed. Core file found - Backtrace follows:
    [New LWP 9732]
    [New LWP 9735]
    [New LWP 9737]
    [New LWP 9736]
    [Thread debugging using libthread_db enabled]
(80 more lines...)
Collapse Failed test_bgp_ecmp_topo1 test_bgp_ecmp History
Topology Tests on Ubuntu 18.04 amd64 1 sec
test teardown failure
E   AssertionError: 
    r1: bgpd crashed. Core file found - Backtrace follows:
    [New LWP 24364]
    [New LWP 24366]
    [New LWP 24367]
    [New LWP 24368]
    [Thread debugging using libthread_db enabled]
(22 more lines...)
Collapse Failed test_bgp_ecmp_topo1 test_bgp_ecmp History
Topology Tests on Ubuntu 16.04 amd64 1 sec
test teardown failure
E   AssertionError: 
    r1: bgpd crashed. Core file found - Backtrace follows:
    [New LWP 14120]
    [New LWP 14124]
    [New LWP 14123]
    [New LWP 14122]
    [Thread debugging using libthread_db enabled]
(22 more lines...)
Collapse Failed test_bgp_ecmp_topo1 test_bgp_ecmp History
TopoTest Tests on Ubuntu 16.04 i386 1 sec
test teardown failure
E   AssertionError: 
    r1: bgpd crashed. Core file found - Backtrace follows:
    [New LWP 1796]
    [New LWP 1799]
    [New LWP 1798]
    [New LWP 1800]
    [Thread debugging using libthread_db enabled]
(18 more lines...)
Collapse Failed test_ebgp_ecmp_topo2 test_ecmp_remove_nw_advertise History
Topology Tests on Ubuntu 18.04 amd64 17 secs
test teardown failure
E   AssertionError: 
    r1: bgpd crashed. Core file found - Backtrace follows:
    [New LWP 25366]
    [New LWP 25369]
    [New LWP 25371]
    [New LWP 25370]
    [Thread debugging using libthread_db enabled]
(47 more lines...)
Collapse Failed test_ebgp_ecmp_topo2 test_ecmp_remove_nw_advertise History
TopoTest Tests on Ubuntu 16.04 i386 17 secs
test teardown failure
E   AssertionError: 
    r1: bgpd crashed. Core file found - Backtrace follows:
    [New LWP 2859]
    [New LWP 2863]
    [New LWP 2862]
    [New LWP 2864]
    [Thread debugging using libthread_db enabled]
(39 more lines...)
Collapse Failed test_ebgp_ecmp_topo2 test_ecmp_remove_nw_advertise History
Topology Tests on Ubuntu 16.04 amd64 16 secs
test teardown failure
E   AssertionError: 
    r1: bgpd crashed. Core file found - Backtrace follows:
    [New LWP 15175]
    [New LWP 15178]
    [New LWP 15180]
    [New LWP 15179]
    [Thread debugging using libthread_db enabled]
(47 more lines...)
Collapse Failed test_ibgp_ecmp_topo2 test_ecmp_remove_nw_advertise History
Topology Tests on Ubuntu 18.04 amd64 17 secs
test teardown failure
E   AssertionError: 
    r1: bgpd crashed. Core file found - Backtrace follows:
    [New LWP 27918]
    [New LWP 27920]
    [New LWP 27922]
    [New LWP 27921]
    [Thread debugging using libthread_db enabled]
(47 more lines...)
Collapse Failed test_ibgp_ecmp_topo2 test_ecmp_remove_nw_advertise History
TopoTest Tests on Ubuntu 16.04 i386 17 secs
test teardown failure
E   AssertionError: 
    r1: bgpd crashed. Core file found - Backtrace follows:
    [New LWP 5483]
    [New LWP 5486]
    [New LWP 5488]
    [New LWP 5487]
    [Thread debugging using libthread_db enabled]
(39 more lines...)
Collapse Failed test_ibgp_ecmp_topo2 test_ecmp_remove_nw_advertise History
Topology Tests on Ubuntu 16.04 amd64 16 secs
test teardown failure
E   AssertionError: 
    r1: bgpd crashed. Core file found - Backtrace follows:
    [New LWP 17726]
    [New LWP 17729]
    [New LWP 17731]
    [New LWP 17730]
    [Thread debugging using libthread_db enabled]
(47 more lines...)
Collapse Failed test_bgp_instance_del_test test_memory_leak History
TopoTest Tests on Ubuntu 16.04 i386 4 secs
AssertionError:  r4: bgpd crashed. Core file found - Backtrace follows: [New LWP 21336] [New LWP 21344] [New LWP 21343] [New LWP 21345] [Thread debugging using libthread_db enabled] Using host libthread_db library "/lib/i386-linux-gnu/libthread_db.so.1". Core was generated by `/usr/lib/frr/bgpd'. Program terminated with signal SIGABRT, Aborted. #0  0xb7fc6cf5 in ?? () [Current thread is 1 (Thread 0xb78ff7c0 (LWP 21336))] #0  0xb7fc6cf5 in ?? () #1  0xb7f47957 in route_next () from /usr/lib/i386-linux-gnu/frr/libfrr.so.0 #2  0x0053c9bf in ?? () #3  0x00541c08 in bgp_clear_route () #4  0x00541db6 in bgp_clear_route_all () #5  0x0051de83 in bgp_fsm_change_status () #6  0x00592c95 in peer_delete () #7  0x0059510d in bgp_delete () #8  0x004fbad5 in sigint () #9  0xb7f3e761 in quagga_sigevent_process () from /usr/lib/i386-linux-gnu/frr/libfrr.so.0 #10 0xb7f4bf08 in thread_fetch () from /usr/lib/i386-linux-gnu/frr/libfrr.so.0 #11 0xb7f13dbe in frr_run () from /usr/lib/i386-linux-gnu/frr/libfrr.so.0 #12 0x004f95e0 in main ()
E   AssertionError: 
    r4: bgpd crashed. Core file found - Backtrace follows:
    [New LWP 21336]
    [New LWP 21344]
    [New LWP 21343]
    [New LWP 21345]
    [Thread debugging using libthread_db enabled]
(18 more lines...)
Collapse Failed test_bgp_instance_del_test test_memory_leak History
Topology Tests on Ubuntu 18.04 amd64 4 secs
AssertionError:  r4: bgpd crashed. Core file found - Backtrace follows: [New LWP 10788] [New LWP 10796] [New LWP 10795] [New LWP 10797] [Thread debugging using libthread_db enabled] Using host libthread_db library "/lib/x86_64-linux-gnu/libthread_db.so.1". Core was generated by `/usr/lib/frr/bgpd'. Program terminated with signal SIGABRT, Aborted. #0  __GI_raise (sig=sig@entry=6) at ../sysdeps/unix/sysv/linux/raise.c:51 [Current thread is 1 (Thread 0x7fe7137477c0 (LWP 10788))] #0  __GI_raise (sig=sig@entry=6) at ../sysdeps/unix/sysv/linux/raise.c:51 #1  0x00007fe7125b1801 in __GI_abort () at abort.c:79 #2  0x00007fe7125a139a in __assert_fail_base (fmt=0x7fe7127287d8 "%s%s%s:%u: %s%sAssertion `%s' failed.\n%n", assertion=assertion@entry=0x7fe7133eaa01 "node->info == NULL", file=file@entry=0x7fe7133ea9c5 "lib/table.c", line=line@entry=344, function=function@entry=0x7fe7133eabf0 "route_node_delete") at assert.c:92 #3  0x00007fe7125a1412 in __GI___assert_fail (assertion=0x7fe7133eaa01 "node->info == NULL", file=0x7fe7133ea9c5 "lib/table.c", line=344, function=0x7fe7133eabf0 "route_node_delete") at assert.c:101 #4  0x00007fe7133ae05e in route_node_delete () from /usr/lib/x86_64-linux-gnu/frr/libfrr.so.0 #5  0x00007fe7133ae0f9 in route_next () from /usr/lib/x86_64-linux-gnu/frr/libfrr.so.0 #6  0x00005571d5ced5de in ?? () #7  0x00005571d5cf2f4b in bgp_clear_route () #8  0x00005571d5cf3110 in bgp_clear_route_all () #9  0x00005571d5ccf82c in bgp_fsm_change_status () #10 0x00005571d5d437fb in peer_delete () #11 0x00005571d5d462e9 in bgp_delete () #12 0x00005571d5cae1a2 in sigint () #13 0x00007fe7133a52d3 in quagga_sigevent_process () from /usr/lib/x86_64-linux-gnu/frr/libfrr.so.0 #14 0x00007fe7133b246d in thread_fetch () from /usr/lib/x86_64-linux-gnu/frr/libfrr.so.0 #15 0x00007fe71337cfe3 in frr_run () from /usr/lib/x86_64-linux-gnu/frr/libfrr.so.0 #16 0x00005571d5cabdd1 in main ()
E   AssertionError: 
    r4: bgpd crashed. Core file found - Backtrace follows:
    [New LWP 10788]
    [New LWP 10796]
    [New LWP 10795]
    [New LWP 10797]
    [Thread debugging using libthread_db enabled]
(22 more lines...)
Collapse Failed test_bgp_instance_del_test test_memory_leak History
Topology Tests on Ubuntu 16.04 amd64 4 secs
AssertionError:  r4: bgpd crashed. Core file found - Backtrace follows: [New LWP 1114] [New LWP 1121] [New LWP 1123] [New LWP 1122] [Thread debugging using libthread_db enabled] Using host libthread_db library "/lib/x86_64-linux-gnu/libthread_db.so.1". Core was generated by `/usr/lib/frr/bgpd'. Program terminated with signal SIGABRT, Aborted. #0  0x00007f36f7857428 in __GI_raise (sig=sig@entry=6) at ../sysdeps/unix/sysv/linux/raise.c:54 [Current thread is 1 (Thread 0x7f36f88b4880 (LWP 1114))] #0  0x00007f36f7857428 in __GI_raise (sig=sig@entry=6) at ../sysdeps/unix/sysv/linux/raise.c:54 #1  0x00007f36f785902a in __GI_abort () at abort.c:89 #2  0x00007f36f784fbd7 in __assert_fail_base (fmt=<optimized out>, assertion=assertion@entry=0x7f36f85dd241 "node->info == NULL", file=file@entry=0x7f36f85dd205 "lib/table.c", line=line@entry=344, function=function@entry=0x7f36f85dd430 "route_node_delete") at assert.c:92 #3  0x00007f36f784fc82 in __GI___assert_fail (assertion=0x7f36f85dd241 "node->info == NULL", file=0x7f36f85dd205 "lib/table.c", line=344, function=0x7f36f85dd430 "route_node_delete") at assert.c:101 #4  0x00007f36f85a0bfd in route_node_delete () from /usr/lib/x86_64-linux-gnu/frr/libfrr.so.0 #5  0x00007f36f85a0cb1 in route_next () from /usr/lib/x86_64-linux-gnu/frr/libfrr.so.0 #6  0x0000562c14bf9e39 in ?? () #7  0x0000562c14bff35c in bgp_clear_route () #8  0x0000562c14bff510 in bgp_clear_route_all () #9  0x0000562c14bdc20c in bgp_fsm_change_status () #10 0x0000562c14c4edbb in peer_delete () #11 0x0000562c14c517d9 in bgp_delete () #12 0x0000562c14bbb204 in sigint () #13 0x00007f36f8597d53 in quagga_sigevent_process () from /usr/lib/x86_64-linux-gnu/frr/libfrr.so.0 #14 0x00007f36f85a51cd in thread_fetch () from /usr/lib/x86_64-linux-gnu/frr/libfrr.so.0 #15 0x00007f36f856f893 in frr_run () from /usr/lib/x86_64-linux-gnu/frr/libfrr.so.0 #16 0x0000562c14bb8e01 in main ()
E   AssertionError: 
    r4: bgpd crashed. Core file found - Backtrace follows:
    [New LWP 1114]
    [New LWP 1121]
    [New LWP 1123]
    [New LWP 1122]
    [Thread debugging using libthread_db enabled]
(22 more lines...)
Collapse Failed test_bgp_ipv6_rtadv test_memory_leak History
Topology Tests on Ubuntu 18.04 amd64 3 secs
AssertionError:  r1: bgpd crashed. Core file found - Backtrace follows: [New LWP 12343] [New LWP 12346] [New LWP 12347] [New LWP 12348] [Thread debugging using libthread_db enabled] Using host libthread_db library "/lib/x86_64-linux-gnu/libthread_db.so.1". Core was generated by `/usr/lib/frr/bgpd'. Program terminated with signal SIGABRT, Aborted. #0  __GI_raise (sig=sig@entry=6) at ../sysdeps/unix/sysv/linux/raise.c:51 [Current thread is 1 (Thread 0x7fc7ffb177c0 (LWP 12343))] #0  __GI_raise (sig=sig@entry=6) at ../sysdeps/unix/sysv/linux/raise.c:51 #1  0x00007fc7fe981801 in __GI_abort () at abort.c:79 #2  0x00007fc7fe97139a in __assert_fail_base (fmt=0x7fc7feaf87d8 "%s%s%s:%u: %s%sAssertion `%s' failed.\n%n", assertion=assertion@entry=0x7fc7ff7baa01 "node->info == NULL", file=file@entry=0x7fc7ff7ba9c5 "lib/table.c", line=line@entry=344, function=function@entry=0x7fc7ff7babf0 "route_node_delete") at assert.c:92 #3  0x00007fc7fe971412 in __GI___assert_fail (assertion=0x7fc7ff7baa01 "node->info == NULL", file=0x7fc7ff7ba9c5 "lib/table.c", line=344, function=0x7fc7ff7babf0 "route_node_delete") at assert.c:101 #4  0x00007fc7ff77e05e in route_node_delete () from /usr/lib/x86_64-linux-gnu/frr/libfrr.so.0 #5  0x00007fc7ff77e0f9 in route_next () from /usr/lib/x86_64-linux-gnu/frr/libfrr.so.0 #6  0x0000561bd60105de in ?? () #7  0x0000561bd6015f4b in bgp_clear_route () #8  0x0000561bd6016110 in bgp_clear_route_all () #9  0x0000561bd5ff282c in bgp_fsm_change_status () #10 0x0000561bd60667fb in peer_delete () #11 0x0000561bd6068bac in peer_group_delete () #12 0x0000561bd60692a5 in bgp_delete () #13 0x0000561bd5fd11ee in sigint () #14 0x00007fc7ff7752d3 in quagga_sigevent_process () from /usr/lib/x86_64-linux-gnu/frr/libfrr.so.0 #15 0x00007fc7ff78246d in thread_fetch () from /usr/lib/x86_64-linux-gnu/frr/libfrr.so.0 #16 0x00007fc7ff74cfe3 in frr_run () from /usr/lib/x86_64-linux-gnu/frr/libfrr.so.0 #17 0x0000561bd5fcedd1 in main ()
E   AssertionError: 
    r1: bgpd crashed. Core file found - Backtrace follows:
    [New LWP 12343]
    [New LWP 12346]
    [New LWP 12347]
    [New LWP 12348]
    [Thread debugging using libthread_db enabled]
(23 more lines...)
Collapse Failed test_bgp_ipv6_rtadv test_memory_leak History
TopoTest Tests on Ubuntu 16.04 i386 3 secs
AssertionError:  r1: bgpd crashed. Core file found - Backtrace follows: [New LWP 22912] [New LWP 22915] [New LWP 22916] [New LWP 22917] [Thread debugging using libthread_db enabled] Using host libthread_db library "/lib/i386-linux-gnu/libthread_db.so.1". Core was generated by `/usr/lib/frr/bgpd'. Program terminated with signal SIGABRT, Aborted. #0  0xb7fa3cf5 in ?? () [Current thread is 1 (Thread 0xb78dc7c0 (LWP 22912))] #0  0xb7fa3cf5 in ?? () #1  0xb7f24957 in route_next () from /usr/lib/i386-linux-gnu/frr/libfrr.so.0 #2  0x005029bf in ?? () #3  0x00507c08 in bgp_clear_route () #4  0x00507db6 in bgp_clear_route_all () #5  0x004e3e83 in bgp_fsm_change_status () #6  0x00558c95 in peer_delete () #7  0x0055a988 in peer_group_delete () #8  0x0055b0c6 in bgp_delete () #9  0x004c1b00 in sigint () #10 0xb7f1b761 in quagga_sigevent_process () from /usr/lib/i386-linux-gnu/frr/libfrr.so.0 #11 0xb7f28f08 in thread_fetch () from /usr/lib/i386-linux-gnu/frr/libfrr.so.0 #12 0xb7ef0dbe in frr_run () from /usr/lib/i386-linux-gnu/frr/libfrr.so.0 #13 0x004bf5e0 in main ()
E   AssertionError: 
    r1: bgpd crashed. Core file found - Backtrace follows:
    [New LWP 22912]
    [New LWP 22915]
    [New LWP 22916]
    [New LWP 22917]
    [Thread debugging using libthread_db enabled]
(19 more lines...)
Collapse Failed test_bgp_ipv6_rtadv test_memory_leak History
Topology Tests on Ubuntu 16.04 amd64 2 secs
AssertionError:  r1: bgpd crashed. Core file found - Backtrace follows: [New LWP 2689] [New LWP 2692] [New LWP 2694] [New LWP 2693] [Thread debugging using libthread_db enabled] Using host libthread_db library "/lib/x86_64-linux-gnu/libthread_db.so.1". Core was generated by `/usr/lib/frr/bgpd'. Program terminated with signal SIGABRT, Aborted. #0  0x00007f2f74bb4428 in __GI_raise (sig=sig@entry=6) at ../sysdeps/unix/sysv/linux/raise.c:54 [Current thread is 1 (Thread 0x7f2f75c11880 (LWP 2689))] #0  0x00007f2f74bb4428 in __GI_raise (sig=sig@entry=6) at ../sysdeps/unix/sysv/linux/raise.c:54 #1  0x00007f2f74bb602a in __GI_abort () at abort.c:89 #2  0x00007f2f74bacbd7 in __assert_fail_base (fmt=<optimized out>, assertion=assertion@entry=0x7f2f7593a241 "node->info == NULL", file=file@entry=0x7f2f7593a205 "lib/table.c", line=line@entry=344, function=function@entry=0x7f2f7593a430 "route_node_delete") at assert.c:92 #3  0x00007f2f74bacc82 in __GI___assert_fail (assertion=0x7f2f7593a241 "node->info == NULL", file=0x7f2f7593a205 "lib/table.c", line=344, function=0x7f2f7593a430 "route_node_delete") at assert.c:101 #4  0x00007f2f758fdbfd in route_node_delete () from /usr/lib/x86_64-linux-gnu/frr/libfrr.so.0 #5  0x00007f2f758fdcb1 in route_next () from /usr/lib/x86_64-linux-gnu/frr/libfrr.so.0 #6  0x0000557b31ef4e39 in ?? () #7  0x0000557b31efa35c in bgp_clear_route () #8  0x0000557b31efa510 in bgp_clear_route_all () #9  0x0000557b31ed720c in bgp_fsm_change_status () #10 0x0000557b31f49dbb in peer_delete () #11 0x0000557b31f4c0c1 in peer_group_delete () #12 0x0000557b31f4c795 in bgp_delete () #13 0x0000557b31eb6228 in sigint () #14 0x00007f2f758f4d53 in quagga_sigevent_process () from /usr/lib/x86_64-linux-gnu/frr/libfrr.so.0 #15 0x00007f2f759021cd in thread_fetch () from /usr/lib/x86_64-linux-gnu/frr/libfrr.so.0 #16 0x00007f2f758cc893 in frr_run () from /usr/lib/x86_64-linux-gnu/frr/libfrr.so.0 #17 0x0000557b31eb3e01 in main ()
E   AssertionError: 
    r1: bgpd crashed. Core file found - Backtrace follows:
    [New LWP 2689]
    [New LWP 2692]
    [New LWP 2694]
    [New LWP 2693]
    [Thread debugging using libthread_db enabled]
(23 more lines...)
Collapse Failed test_bgp_l3vpn_to_bgp_direct test_memory_leak History
Topology Tests on Ubuntu 18.04 amd64 4 secs
AssertionError:  r4: bgpd crashed. Core file found - Backtrace follows: [New LWP 12908] [New LWP 12916] [New LWP 12918] [New LWP 12917] [Thread debugging using libthread_db enabled] Using host libthread_db library "/lib/x86_64-linux-gnu/libthread_db.so.1". Core was generated by `/usr/lib/frr/bgpd'. Program terminated with signal SIGABRT, Aborted. #0  __GI_raise (sig=sig@entry=6) at ../sysdeps/unix/sysv/linux/raise.c:51 [Current thread is 1 (Thread 0x7fedc6e267c0 (LWP 12908))] #0  __GI_raise (sig=sig@entry=6) at ../sysdeps/unix/sysv/linux/raise.c:51 #1  0x00007fedc5c90801 in __GI_abort () at abort.c:79 #2  0x00007fedc5c8039a in __assert_fail_base (fmt=0x7fedc5e077d8 "%s%s%s:%u: %s%sAssertion `%s' failed.\n%n", assertion=assertion@entry=0x7fedc6ac9a01 "node->info == NULL", file=file@entry=0x7fedc6ac99c5 "lib/table.c", line=line@entry=344, function=function@entry=0x7fedc6ac9bf0 "route_node_delete") at assert.c:92 #3  0x00007fedc5c80412 in __GI___assert_fail (assertion=0x7fedc6ac9a01 "node->info == NULL", file=0x7fedc6ac99c5 "lib/table.c", line=344, function=0x7fedc6ac9bf0 "route_node_delete") at assert.c:101 #4  0x00007fedc6a8d05e in route_node_delete () from /usr/lib/x86_64-linux-gnu/frr/libfrr.so.0 #5  0x00007fedc6a8d0f9 in route_next () from /usr/lib/x86_64-linux-gnu/frr/libfrr.so.0 #6  0x000055d7ad6055de in ?? () #7  0x000055d7ad60af4b in bgp_clear_route () #8  0x000055d7ad60b110 in bgp_clear_route_all () #9  0x000055d7ad5e782c in bgp_fsm_change_status () #10 0x000055d7ad65b7fb in peer_delete () #11 0x000055d7ad65e2d5 in bgp_delete () #12 0x000055d7ad5c61ee in sigint () #13 0x00007fedc6a842d3 in quagga_sigevent_process () from /usr/lib/x86_64-linux-gnu/frr/libfrr.so.0 #14 0x00007fedc6a9146d in thread_fetch () from /usr/lib/x86_64-linux-gnu/frr/libfrr.so.0 #15 0x00007fedc6a5bfe3 in frr_run () from /usr/lib/x86_64-linux-gnu/frr/libfrr.so.0 #16 0x000055d7ad5c3dd1 in main ()
E   AssertionError: 
    r4: bgpd crashed. Core file found - Backtrace follows:
    [New LWP 12908]
    [New LWP 12916]
    [New LWP 12918]
    [New LWP 12917]
    [Thread debugging using libthread_db enabled]
(22 more lines...)
Collapse Failed test_bgp_l3vpn_to_bgp_direct test_memory_leak History
Topology Tests on Ubuntu 16.04 amd64 4 secs
AssertionError:  r4: bgpd crashed. Core file found - Backtrace follows: [New LWP 3386] [New LWP 3394] [New LWP 3396] [New LWP 3395] [Thread debugging using libthread_db enabled] Using host libthread_db library "/lib/x86_64-linux-gnu/libthread_db.so.1". Core was generated by `/usr/lib/frr/bgpd'. Program terminated with signal SIGABRT, Aborted. #0  0x00007fcd6f698428 in __GI_raise (sig=sig@entry=6) at ../sysdeps/unix/sysv/linux/raise.c:54 [Current thread is 1 (Thread 0x7fcd706f5880 (LWP 3386))] #0  0x00007fcd6f698428 in __GI_raise (sig=sig@entry=6) at ../sysdeps/unix/sysv/linux/raise.c:54 #1  0x00007fcd6f69a02a in __GI_abort () at abort.c:89 #2  0x00007fcd6f690bd7 in __assert_fail_base (fmt=<optimized out>, assertion=assertion@entry=0x7fcd7041e241 "node->info == NULL", file=file@entry=0x7fcd7041e205 "lib/table.c", line=line@entry=344, function=function@entry=0x7fcd7041e430 "route_node_delete") at assert.c:92 #3  0x00007fcd6f690c82 in __GI___assert_fail (assertion=0x7fcd7041e241 "node->info == NULL", file=0x7fcd7041e205 "lib/table.c", line=344, function=0x7fcd7041e430 "route_node_delete") at assert.c:101 #4  0x00007fcd703e1bfd in route_node_delete () from /usr/lib/x86_64-linux-gnu/frr/libfrr.so.0 #5  0x00007fcd703e1cb1 in route_next () from /usr/lib/x86_64-linux-gnu/frr/libfrr.so.0 #6  0x0000563a76079e39 in ?? () #7  0x0000563a7607f35c in bgp_clear_route () #8  0x0000563a7607f510 in bgp_clear_route_all () #9  0x0000563a7605c20c in bgp_fsm_change_status () #10 0x0000563a760cedbb in peer_delete () #11 0x0000563a760d17c5 in bgp_delete () #12 0x0000563a7603b228 in sigint () #13 0x00007fcd703d8d53 in quagga_sigevent_process () from /usr/lib/x86_64-linux-gnu/frr/libfrr.so.0 #14 0x00007fcd703e61cd in thread_fetch () from /usr/lib/x86_64-linux-gnu/frr/libfrr.so.0 #15 0x00007fcd703b0893 in frr_run () from /usr/lib/x86_64-linux-gnu/frr/libfrr.so.0 #16 0x0000563a76038e01 in main ()
E   AssertionError: 
    r4: bgpd crashed. Core file found - Backtrace follows:
    [New LWP 3386]
    [New LWP 3394]
    [New LWP 3396]
    [New LWP 3395]
    [Thread debugging using libthread_db enabled]
(22 more lines...)