FreeRangeRouting Github Pull Request Testing

Build: #12377 failed Custom build by Github Hook with revision master

Build result summary

Details

Completed
Duration
111 minutes
Flags
Custom revisionCustom build
Labels
version=frr-7_4-dev-1479-gc926216adgit=https_//github_com/frrouting/frr_gitbuildurl=https_//ci1_netdef_org/browse/frr-frrpullreq-12377branch=master
Revision
cb47b207f520ce9450f7b15fc4818b867cbc0c54 cb47b207f520ce9450f7b15fc4818b867cbc0c54
Total tests
7199
Fixed in
#12379 (Custom build by Github Hook with revision master)

Tests

Custom variables

Custom revision
cb47b207f520ce9450f7b15fc4818b867cbc0c54 cb47b207f520ce9450f7b15fc4818b867cbc0c54
Name Value
github_base_sha cb47b207f520ce9450f7b15fc4818b867cbc0c54
github_pullreq 6444
github_repo FRRouting/frr
github_merge_sha c926216ad5313f4e11a50825c04dde751e397a62
github_branch master

Comments

  1. Github Hook

    GitHub Merge Request 6444
    for GitHub Repo FRRouting/frr, branch master

    Request to merge from donaldsharp/frr
    Merge Git Commit ID c926216ad5313f4e11a50825c04dde751e397a62 on top of base Git Commit ID cb47b207f520ce9450f7b15fc4818b867cbc0c54

Code commits

Author Commit Message Commit date
Russ White <russ@riw.us> Russ White <russ@riw.us> cb47b207f520ce9450f7b15fc4818b867cbc0c54 cb47b207f520ce9450f7b15fc4818b867cbc0c54 Merge pull request #6407 from donaldsharp/revert_ospfv3_fix
ospf6d: Revert "ospf6d: Prevent use after free"

Tests

New test failures 3
Status Test View job Duration
Collapse Failed test_isis_sr_topo1 test_rib_ipv6_step1 History
Topo Tests Part 0 on Ubuntu 16.04 amd64 1 min
AssertionError: "rt3" JSON output mismatches the expected result assert Generated JSON diff error report:      > $->2001:db8:1000::4/128: d2 has the following element at index 0 which is not present in d1:        {        "distance": 115,        "destSelected": true,        "protocol": "isis",        "metric": 30,        "selected": true,        "installed": true,        "prefix": "2001:db8:1000::4/128",        "nexthops": [            {                "fib": true,                "active": true,                "labels": [                    16041                ],                "afi": "ipv6",                "interfaceName": "eth-rt5-2"            },            {                "fib": true,                "active": true,                "labels": [                    16041                ],                "afi": "ipv6",                "interfaceName": "eth-sw1"            },            {                "fib": true,                "active": true,                "labels": [                    16041                ],                "afi": "ipv6",                "interfaceName": "eth-rt5-1"            }        ]    }       Closest match in d1 is at index 0 with the following errors:        > $->2001:db8:1000::4/128[0]->nexthops: d2 has the following element at index 1 which is not present in d1:          {         "fib": true,         "active": true,         "labels": [             16041         ],         "afi": "ipv6",         "interfaceName": "eth-sw1"     }         Closest match in d1 is at index 0 with the following errors:          > $->2001:db8:1000::4/128[0]->nexthops[0]->labels: d1 has Array of length 0 but in d2 it is of length 1        > $->2001:db8:1000::4/128[0]->nexthops: d2 has the following element at index 2 which is not present in d1:          {         "fib": true,         "active": true,         "labels": [             16041         ],         "afi": "ipv6",         "interfaceName": "eth-rt5-1"     }         Closest match in d1 is at index 1 with the following errors:          > $->2001:db8:1000::4/128[0]->nexthops[1]->labels: d1 has Array of length 0 but in d2 it is of length 1
E   AssertionError: "rt3" JSON output mismatches the expected result
    assert Generated JSON diff error report:
      
      > $->2001:db8:1000::4/128: d2 has the following element at index 0 which is not present in d1: 
      
      	{
      	    "distance": 115,
(70 more lines...)
Collapse Failed test_isis_sr_topo1 test_rib_ipv6_step1 History
Topo Tests Part 0 on Ubuntu 16.04 i386 1 min
AssertionError: "rt3" JSON output mismatches the expected result assert Generated JSON diff error report:      > $->2001:db8:1000::6/128: d2 has the following element at index 0 which is not present in d1:        {        "distance": 115,        "destSelected": true,        "protocol": "isis",        "metric": 30,        "selected": true,        "installed": true,        "prefix": "2001:db8:1000::6/128",        "nexthops": [            {                "fib": true,                "active": true,                "labels": [                    16061                ],                "afi": "ipv6",                "interfaceName": "eth-rt5-2"            },            {                "fib": true,                "active": true,                "labels": [                    16061                ],                "afi": "ipv6",                "interfaceName": "eth-rt5-1"            }        ]    }       Closest match in d1 is at index 0 with the following errors:        > $->2001:db8:1000::6/128[0]->nexthops: d2 has the following element at index 1 which is not present in d1:          {         "fib": true,         "active": true,         "labels": [             16061         ],         "afi": "ipv6",         "interfaceName": "eth-rt5-1"     }         Closest match in d1 is at index 0 with the following errors:          > $->2001:db8:1000::6/128[0]->nexthops[0]->labels: d1 has Array of length 0 but in d2 it is of length 1          > $->2001:db8:1000::5/128: d2 has the following element at index 0 which is not present in d1:        {        "distance": 115,        "destSelected": true,        "protocol": "isis",        "metric": 20,        "selected": true,        "installed": true,        "prefix": "2001:db8:1000::5/128",        "nexthops": [            {                "fib": true,                "active": true,                "labels": [                    16051                ],                "afi": "ipv6",                "interfaceName": "eth-rt5-2"            },            {                "fib": true,                "active": true,                "labels": [                    16051                ],                "afi": "ipv6",                "interfaceName": "eth-rt5-1"            }        ]    }       Closest match in d1 is at index 0 with the following errors:        > $->2001:db8:1000::5/128[0]->nexthops: d2 has the following element at index 1 which is not present in d1:          {         "fib": true,         "active": true,         "labels": [             16051         ],         "afi": "ipv6",         "interfaceName": "eth-rt5-1"     }         Closest match in d1 is at index 0 with the following errors:          > $->2001:db8:1000::5/128[0]->nexthops[0]->labels: d1 has Array of length 0 but in d2 it is of length 1          > $->2001:db8:1000::4/128: d2 has the following element at index 0 which is not present in d1:        {        "distance": 115,        "destSelected": true,        "protocol": "isis",        "metric": 30,        "selected": true,        "installed": true,        "prefix": "2001:db8:1000::4/128",        "nexthops": [            {                "fib": true,                "active": true,                "labels": [                    16041                ],                "afi": "ipv6",                "interfaceName": "eth-rt5-2"            },            {                "fib": true,                "active": true,                "labels": [                    16041                ],                "afi": "ipv6",                "interfaceName": "eth-sw1"            },            {                "fib": true,                "active": true,                "labels": [                    16041                ],                "afi": "ipv6",                "interfaceName": "eth-rt5-1"            }        ]    }       Closest match in d1 is at index 0 with the following errors:        > $->2001:db8:1000::4/128[0]->nexthops: d2 has the following element at index 1 which is not present in d1:          {         "fib": true,         "active": true,         "labels": [             16041         ],         "afi": "ipv6",         "interfaceName": "eth-sw1"     }         Closest match in d1 is at index 1 with the following errors:          > $->2001:db8:1000::4/128[0]->nexthops[1]->labels: d1 has Array of length 0 but in d2 it is of length 1        > $->2001:db8:1000::4/128[0]->nexthops: d2 has the following element at index 2 which is not present in d1:          {         "fib": true,         "active": true,         "labels": [             16041         ],         "afi": "ipv6",         "interfaceName": "eth-rt5-1"     }         Closest match in d1 is at index 0 with the following errors:          > $->2001:db8:1000::4/128[0]->nexthops[0]->labels: d1 has Array of length 0 but in d2 it is of length 1
E   AssertionError: "rt3" JSON output mismatches the expected result
    assert Generated JSON diff error report:
      
      > $->2001:db8:1000::6/128: d2 has the following element at index 0 which is not present in d1: 
      
      	{
      	    "distance": 115,
(172 more lines...)
Collapse Failed test_isis_sr_topo1 test_rib_ipv6_step1 History
Topo Tests Part 0 on Ubuntu 18.04 amd64 1 min
AssertionError: "rt3" JSON output mismatches the expected result assert Generated JSON diff error report:      > $->2001:db8:1000::6/128: d2 has the following element at index 0 which is not present in d1:        {        "distance": 115,        "destSelected": true,        "protocol": "isis",        "metric": 30,        "selected": true,        "installed": true,        "prefix": "2001:db8:1000::6/128",        "nexthops": [            {                "fib": true,                "active": true,                "labels": [                    16061                ],                "afi": "ipv6",                "interfaceName": "eth-rt5-2"            },            {                "fib": true,                "active": true,                "labels": [                    16061                ],                "afi": "ipv6",                "interfaceName": "eth-rt5-1"            }        ]    }       Closest match in d1 is at index 0 with the following errors:        > $->2001:db8:1000::6/128[0]->nexthops: d2 has the following element at index 1 which is not present in d1:          {         "fib": true,         "active": true,         "labels": [             16061         ],         "afi": "ipv6",         "interfaceName": "eth-rt5-1"     }         Closest match in d1 is at index 0 with the following errors:          > $->2001:db8:1000::6/128[0]->nexthops[0]->labels: d1 has Array of length 0 but in d2 it is of length 1          > $->2001:db8:1000::5/128: d2 has the following element at index 0 which is not present in d1:        {        "distance": 115,        "destSelected": true,        "protocol": "isis",        "metric": 20,        "selected": true,        "installed": true,        "prefix": "2001:db8:1000::5/128",        "nexthops": [            {                "fib": true,                "active": true,                "labels": [                    16051                ],                "afi": "ipv6",                "interfaceName": "eth-rt5-2"            },            {                "fib": true,                "active": true,                "labels": [                    16051                ],                "afi": "ipv6",                "interfaceName": "eth-rt5-1"            }        ]    }       Closest match in d1 is at index 0 with the following errors:        > $->2001:db8:1000::5/128[0]->nexthops: d2 has the following element at index 1 which is not present in d1:          {         "fib": true,         "active": true,         "labels": [             16051         ],         "afi": "ipv6",         "interfaceName": "eth-rt5-1"     }         Closest match in d1 is at index 0 with the following errors:          > $->2001:db8:1000::5/128[0]->nexthops[0]->labels: d1 has Array of length 0 but in d2 it is of length 1          > $->2001:db8:1000::4/128: d2 has the following element at index 0 which is not present in d1:        {        "distance": 115,        "destSelected": true,        "protocol": "isis",        "metric": 30,        "selected": true,        "installed": true,        "prefix": "2001:db8:1000::4/128",        "nexthops": [            {                "fib": true,                "active": true,                "labels": [                    16041                ],                "afi": "ipv6",                "interfaceName": "eth-rt5-2"            },            {                "fib": true,                "active": true,                "labels": [                    16041                ],                "afi": "ipv6",                "interfaceName": "eth-sw1"            },            {                "fib": true,                "active": true,                "labels": [                    16041                ],                "afi": "ipv6",                "interfaceName": "eth-rt5-1"            }        ]    }       Closest match in d1 is at index 0 with the following errors:        > $->2001:db8:1000::4/128[0]->nexthops: d2 has the following element at index 2 which is not present in d1:          {         "fib": true,         "active": true,         "labels": [             16041         ],         "afi": "ipv6",         "interfaceName": "eth-rt5-1"     }         Closest match in d1 is at index 0 with the following errors:          > $->2001:db8:1000::4/128[0]->nexthops[0]->labels: d1 has Array of length 0 but in d2 it is of length 1
E   AssertionError: "rt3" JSON output mismatches the expected result
    assert Generated JSON diff error report:
      
      > $->2001:db8:1000::6/128: d2 has the following element at index 0 which is not present in d1: 
      
      	{
      	    "distance": 115,
(156 more lines...)