FreeRangeRouting Github Pull Request Testing

Build: #13425 failed Custom build by Github Hook with revision master

Build result summary

Details

Completed
Duration
133 minutes
Flags
Custom revisionCustom build
Labels
version=frr-7_4-dev-2105-gb85306aeegit=https_//github_com/frrouting/frr_gitbuildurl=https_//ci1_netdef_org/browse/frr-frrpullreq-13425branch=master
Revision
5a45d613089615a3096433a3ba1e1977fd6bce4d 5a45d613089615a3096433a3ba1e1977fd6bce4d
Total tests
8857
Fixed in
#13427 (Custom build by Github Hook with revision master)

Tests

Custom variables

Custom revision
5a45d613089615a3096433a3ba1e1977fd6bce4d 5a45d613089615a3096433a3ba1e1977fd6bce4d
Name Value
github_base_sha 5a45d613089615a3096433a3ba1e1977fd6bce4d
github_pullreq 6837
github_repo FRRouting/frr
github_merge_sha b85306aee661a9d3860702f31f2987057c6aa5f9
github_branch master

Comments

  1. Github Hook

    GitHub Merge Request 6837
    for GitHub Repo FRRouting/frr, branch master

    Request to merge from gpnaveen/frr
    Merge Git Commit ID b85306aee661a9d3860702f31f2987057c6aa5f9 on top of base Git Commit ID 5a45d613089615a3096433a3ba1e1977fd6bce4d

Code commits

Author Commit Message Commit date
Donatas Abraitis <donatas.abraitis@gmail.com> Donatas Abraitis <donatas.abraitis@gmail.com> 5a45d613089615a3096433a3ba1e1977fd6bce4d 5a45d613089615a3096433a3ba1e1977fd6bce4d Merge pull request #6833 from donaldsharp/pcount_selected
bgpd: Add to neighbor prefix-counts the count of best path selected

Tests

New test failures 65
Status Test View job Duration
Collapse Failed test_rfc5549_default_red_vrf test_rfc5549_vrf_tc44_p0 History
Topo Tests Part 2 on Ubuntu 16.04 i386 3 mins
test setup failure
E   AssertionError: setup_module :Failed 
       Error: [DUT: r1] VRF: default, BGP is not converged for ipv4 address-family
    assert '[DUT: r1] VRF: default, BGP is not converged for ipv4 address-family' is True
Collapse Failed test_rfc5549_default_red_vrf test_rfc5549_vrf_tc44_p0 History
Topo Tests Part 2 on Ubuntu 18.04 amd64 3 mins
test setup failure
E   AssertionError: setup_module :Failed 
       Error: [DUT: r1] VRF: default, BGP is not converged for ipv4 address-family
    assert '[DUT: r1] VRF: default, BGP is not converged for ipv4 address-family' is True
Collapse Failed test_rfc5549_default_red_vrf test_rfc5549_vrf_tc44_p0 History
Topo Tests Part 2 on Ubuntu 16.04 amd64 3 mins
test setup failure
E   AssertionError: setup_module :Failed 
       Error: [DUT: r1] VRF: default, BGP is not converged for ipv4 address-family
    assert '[DUT: r1] VRF: default, BGP is not converged for ipv4 address-family' is True
Collapse Failed test_rfc5549_default_red_vrf test_rfc5549_vrf_tc44_p0 History
Topo Tests Part 2 on Ubuntu 18.04 arm8 3 mins
test setup failure
E   AssertionError: setup_module :Failed 
       Error: [DUT: r1] VRF: default, BGP is not converged for ipv4 address-family
    assert '[DUT: r1] VRF: default, BGP is not converged for ipv4 address-family' is True
Collapse Failed test_rfc5549_ebgp_nbr_vrf test_rfc5549_routemap_tc33_vrf_p0 History
Topo Tests Part 2 on Ubuntu 18.04 amd64 6 secs
test setup failure
E   InvalidCLIError: % interface lo not in RED vrf
    line 4: Failure to communicate[13] to zebra, line: interface lo vrf RED 
    
    line 5: % Unknown command[4]: ip address 1.0.2.17/32 
    line 6: % Unknown command[4]: ipv6 address 2001:DB8:F::2:17/128
Collapse Failed test_rfc5549_ebgp_nbr_vrf test_rfc5549_remove_red_static_network_ebgp_peer_tc35_vrf_p0 History
Topo Tests Part 2 on Ubuntu 16.04 i386 < 1 sec
test setup failure
E   InvalidCLIError: % interface lo not in RED vrf
    line 4: Failure to communicate[13] to zebra, line: interface lo vrf RED 
    
    line 5: % Unknown command[4]: ip address 1.0.2.17/32 
    line 6: % Unknown command[4]: ipv6 address 2001:DB8:F::2:17/128
Collapse Failed test_rfc5549_ebgp_nbr_vrf test_rfc5549_routemap_tc33_vrf_p0 History
Topo Tests Part 2 on Ubuntu 16.04 i386 6 secs
test setup failure
E   InvalidCLIError: % interface lo not in RED vrf
    line 4: Failure to communicate[13] to zebra, line: interface lo vrf RED 
    
    line 5: % Unknown command[4]: ip address 1.0.2.17/32 
    line 6: % Unknown command[4]: ipv6 address 2001:DB8:F::2:17/128
Collapse Failed test_rfc5549_ebgp_nbr_vrf test_rfc5549_remove_red_static_network_ebgp_peer_tc35_vrf_p0 History
Topo Tests Part 2 on Ubuntu 16.04 amd64 < 1 sec
test setup failure
E   InvalidCLIError: % interface lo not in RED vrf
    line 4: Failure to communicate[13] to zebra, line: interface lo vrf RED 
    
    line 5: % Unknown command[4]: ip address 1.0.2.17/32 
    line 6: % Unknown command[4]: ipv6 address 2001:DB8:F::2:17/128
Collapse Failed test_rfc5549_ebgp_nbr_vrf test_rfc5549_routemap_tc33_vrf_p0 History
Topo Tests Part 2 on Ubuntu 18.04 arm8 13 secs
test setup failure
E   InvalidCLIError: % interface lo not in RED vrf
    line 4: Failure to communicate[13] to zebra, line: interface lo vrf RED 
    
    line 5: % Unknown command[4]: ip address 1.0.2.17/32 
    line 6: % Unknown command[4]: ipv6 address 2001:DB8:F::2:17/128
Collapse Failed test_rfc5549_ebgp_nbr_vrf test_rfc5549_remove_red_static_network_ebgp_peer_tc35_vrf_p0 History
Topo Tests Part 2 on Ubuntu 18.04 arm8 < 1 sec
test setup failure
E   InvalidCLIError: % interface lo not in RED vrf
    line 4: Failure to communicate[13] to zebra, line: interface lo vrf RED 
    
    line 5: % Unknown command[4]: ip address 1.0.2.17/32 
    line 6: % Unknown command[4]: ipv6 address 2001:DB8:F::2:17/128
Collapse Failed test_rfc5549_ebgp_nbr_vrf test_rfc5549_routemap_tc33_vrf_p0 History
Topo Tests Part 2 on Ubuntu 16.04 amd64 6 secs
test setup failure
E   InvalidCLIError: % interface lo not in RED vrf
    line 4: Failure to communicate[13] to zebra, line: interface lo vrf RED 
    
    line 5: % Unknown command[4]: ip address 1.0.2.17/32 
    line 6: % Unknown command[4]: ipv6 address 2001:DB8:F::2:17/128
Collapse Failed test_rfc5549_ebgp_nbr_vrf test_rfc5549_remove_red_static_network_ebgp_peer_tc35_vrf_p0 History
Topo Tests Part 2 on Ubuntu 18.04 amd64 < 1 sec
test setup failure
E   InvalidCLIError: % interface lo not in RED vrf
    line 4: Failure to communicate[13] to zebra, line: interface lo vrf RED 
    
    line 5: % Unknown command[4]: ip address 1.0.2.17/32 
    line 6: % Unknown command[4]: ipv6 address 2001:DB8:F::2:17/128
Collapse Failed test_rfc5549_ecmp_vrf test_rfc5549_clear_bgp_vrf_tc38_p1 History
Topo Tests Part 2 on Ubuntu 16.04 i386 6 secs
test setup failure
E   InvalidCLIError: % interface lo not in RED vrf
    line 4: Failure to communicate[13] to zebra, line: interface lo vrf RED 
    
    line 5: % Unknown command[4]: ip address 1.0.1.17/32 
    line 6: % Unknown command[4]: ipv6 address 2001:DB8:F::1:17/128
Collapse Failed test_rfc5549_ecmp_vrf test_rfc5549_clear_bgp_vrf_tc38_p1 History
Topo Tests Part 2 on Ubuntu 18.04 amd64 6 secs
test setup failure
E   InvalidCLIError: % interface lo not in RED vrf
    line 4: Failure to communicate[13] to zebra, line: interface lo vrf RED 
    
    line 5: % Unknown command[4]: ip address 1.0.1.17/32 
    line 6: % Unknown command[4]: ipv6 address 2001:DB8:F::1:17/128
Collapse Failed test_rfc5549_ecmp_vrf test_rfc5549_clear_bgp_vrf_tc38_p1 History
Topo Tests Part 2 on Ubuntu 18.04 arm8 14 secs
test setup failure
E   InvalidCLIError: % interface lo not in RED vrf
    line 4: Failure to communicate[13] to zebra, line: interface lo vrf RED 
    
    line 5: % Unknown command[4]: ip address 1.0.1.17/32 
    line 6: % Unknown command[4]: ipv6 address 2001:DB8:F::1:17/128
Collapse Failed test_rfc5549_ecmp_vrf test_rfc5549_clear_bgp_vrf_tc38_p1 History
Topo Tests Part 2 on Ubuntu 16.04 amd64 7 secs
test setup failure
E   InvalidCLIError: % interface lo not in RED vrf
    line 4: Failure to communicate[13] to zebra, line: interface lo vrf RED 
    
    line 5: % Unknown command[4]: ip address 1.0.1.17/32 
    line 6: % Unknown command[4]: ipv6 address 2001:DB8:F::1:17/128
Collapse Failed test_rfc5549_ecmp_vrf_topo2 test_rfc5549_ebgp_ecmp_ibgp_vrf_tc42_p1 History
Topo Tests Part 2 on Ubuntu 16.04 i386 6 secs
test setup failure
E   InvalidCLIError: % interface lo not in RED vrf
    line 4: Failure to communicate[13] to zebra, line: interface lo vrf RED 
    
    line 5: % Unknown command[4]: ip address 1.0.3.17/32 
    line 6: % Unknown command[4]: ipv6 address 2001:DB8:F::3:17/128
Collapse Failed test_rfc5549_ecmp_vrf_topo2 test_rfc5549_ebgp_ecmp_ibgp_vrf_tc42_p1 History
Topo Tests Part 2 on Ubuntu 18.04 arm8 12 secs
test setup failure
E   InvalidCLIError: % interface lo not in RED vrf
    line 4: Failure to communicate[13] to zebra, line: interface lo vrf RED 
    
    line 5: % Unknown command[4]: ip address 1.0.3.17/32 
    line 6: % Unknown command[4]: ipv6 address 2001:DB8:F::3:17/128
Collapse Failed test_rfc5549_ecmp_vrf_topo2 test_rfc5549_ebgp_ecmp_ibgp_vrf_tc42_p1 History
Topo Tests Part 2 on Ubuntu 16.04 amd64 5 secs
test setup failure
E   InvalidCLIError: % interface lo not in RED vrf
    line 4: Failure to communicate[13] to zebra, line: interface lo vrf RED 
    
    line 5: % Unknown command[4]: ip address 1.0.3.17/32 
    line 6: % Unknown command[4]: ipv6 address 2001:DB8:F::3:17/128
Collapse Failed test_rfc5549_ecmp_vrf_topo2 test_rfc5549_ebgp_ecmp_ibgp_vrf_tc42_p1 History
Topo Tests Part 2 on Ubuntu 18.04 amd64 6 secs
test setup failure
E   InvalidCLIError: % interface lo not in RED vrf
    line 4: Failure to communicate[13] to zebra, line: interface lo vrf RED 
    
    line 5: % Unknown command[4]: ip address 1.0.3.17/32 
    line 6: % Unknown command[4]: ipv6 address 2001:DB8:F::3:17/128
Collapse Failed test_rfc5549_ibgp_ebgp_ecmp_vrf test_rfc5549_vrf_tc37_p1 History
Topo Tests Part 2 on Ubuntu 18.04 amd64 5 secs
test setup failure
E   InvalidCLIError: % interface lo not in RED vrf
    line 4: Failure to communicate[13] to zebra, line: interface lo vrf RED 
    
    line 5: % Unknown command[4]: ip address 1.0.1.17/32
Collapse Failed test_rfc5549_ibgp_ebgp_ecmp_vrf test_rfc5549_vrf_tc37_p1 History
Topo Tests Part 2 on Ubuntu 16.04 i386 6 secs
test setup failure
E   InvalidCLIError: % interface lo not in RED vrf
    line 4: Failure to communicate[13] to zebra, line: interface lo vrf RED 
    
    line 5: % Unknown command[4]: ip address 1.0.1.17/32
Collapse Failed test_rfc5549_ibgp_ebgp_ecmp_vrf test_rfc5549_vrf_tc37_p1 History
Topo Tests Part 2 on Ubuntu 16.04 amd64 5 secs
test setup failure
E   InvalidCLIError: % interface lo not in RED vrf
    line 4: Failure to communicate[13] to zebra, line: interface lo vrf RED 
    
    line 5: % Unknown command[4]: ip address 1.0.1.17/32
Collapse Failed test_rfc5549_ibgp_ebgp_ecmp_vrf test_rfc5549_vrf_tc37_p1 History
Topo Tests Part 2 on Ubuntu 18.04 arm8 12 secs
test setup failure
E   InvalidCLIError: % interface lo not in RED vrf
    line 4: Failure to communicate[13] to zebra, line: interface lo vrf RED 
    
    line 5: % Unknown command[4]: ip address 1.0.1.17/32
Collapse Failed test_rfc5549_ibgp_nbr_vrf test_rfc5549_red_static_network_ibgp_peer_tc34_p0 History
Topo Tests Part 2 on Ubuntu 16.04 i386 1 sec
test setup failure
E   AttributeError: 'module' object has no attribute 'startswith'
Collapse Failed test_rfc5549_ibgp_nbr_vrf test_rfc5549_red_static_network_ibgp_peer_tc34_p0 History
Topo Tests Part 2 on Ubuntu 18.04 arm8 2 secs
test setup failure
E   AttributeError: 'module' object has no attribute 'startswith'
Collapse Failed test_rfc5549_ibgp_nbr_vrf test_rfc5549_red_static_network_ibgp_peer_tc34_p0 History
Topo Tests Part 2 on Ubuntu 18.04 amd64 1 sec
test setup failure
E   AttributeError: 'module' object has no attribute 'startswith'
Collapse Failed test_rfc5549_ibgp_nbr_vrf test_rfc5549_red_static_network_ibgp_peer_tc34_p0 History
Topo Tests Part 2 on Ubuntu 16.04 amd64 1 sec
test setup failure
E   AttributeError: 'module' object has no attribute 'startswith'
Collapse Failed test_rfc5549_red_default_vrf test_rfc5549_vrf_tc47_p0 History
Topo Tests Part 2 on Ubuntu 18.04 amd64 5 secs
test setup failure
E   InvalidCLIError: % interface lo not in RED vrf
    line 4: Failure to communicate[13] to zebra, line: interface lo vrf RED 
    
    line 5: % Unknown command[4]: ip address 1.0.1.17/32
Collapse Failed test_rfc5549_red_default_vrf test_rfc5549_vrf_tc45_p0 History
Topo Tests Part 2 on Ubuntu 18.04 amd64 < 1 sec
test setup failure
E   InvalidCLIError: % interface lo not in RED vrf
    line 4: Failure to communicate[13] to zebra, line: interface lo vrf RED 
    
    line 5: % Unknown command[4]: ip address 1.0.1.17/32
Collapse Failed test_rfc5549_red_default_vrf test_rfc5549_vrf_tc36_p0 History
Topo Tests Part 2 on Ubuntu 18.04 amd64 < 1 sec
test setup failure
E   InvalidCLIError: % interface lo not in RED vrf
    line 4: Failure to communicate[13] to zebra, line: interface lo vrf RED 
    
    line 5: % Unknown command[4]: ip address 1.0.1.17/32
Collapse Failed test_rfc5549_red_default_vrf test_rfc5549_vrf_tc36_p0 History
Topo Tests Part 2 on Ubuntu 16.04 amd64 < 1 sec
test setup failure
E   InvalidCLIError: % interface lo not in RED vrf
    line 4: Failure to communicate[13] to zebra, line: interface lo vrf RED 
    
    line 5: % Unknown command[4]: ip address 1.0.1.17/32
Collapse Failed test_rfc5549_red_default_vrf test_rfc5549_vrf_tc45_p0 History
Topo Tests Part 2 on Ubuntu 16.04 amd64 < 1 sec
test setup failure
E   InvalidCLIError: % interface lo not in RED vrf
    line 4: Failure to communicate[13] to zebra, line: interface lo vrf RED 
    
    line 5: % Unknown command[4]: ip address 1.0.1.17/32
Collapse Failed test_rfc5549_red_default_vrf test_rfc5549_vrf_tc47_p0 History
Topo Tests Part 2 on Ubuntu 16.04 amd64 5 secs
test setup failure
E   InvalidCLIError: % interface lo not in RED vrf
    line 4: Failure to communicate[13] to zebra, line: interface lo vrf RED 
    
    line 5: % Unknown command[4]: ip address 1.0.1.17/32
Collapse Failed test_rfc5549_red_default_vrf test_rfc5549_vrf_tc50_p2 History
Topo Tests Part 2 on Ubuntu 16.04 amd64 < 1 sec
test setup failure
E   InvalidCLIError: % interface lo not in RED vrf
    line 4: Failure to communicate[13] to zebra, line: interface lo vrf RED 
    
    line 5: % Unknown command[4]: ip address 1.0.1.17/32
Collapse Failed test_rfc5549_red_default_vrf test_rfc5549_vrf_tc47_p0 History
Topo Tests Part 2 on Ubuntu 18.04 arm8 11 secs
test setup failure
E   InvalidCLIError: % interface lo not in RED vrf
    line 4: Failure to communicate[13] to zebra, line: interface lo vrf RED 
    
    line 5: % Unknown command[4]: ip address 1.0.1.17/32
Collapse Failed test_rfc5549_red_default_vrf test_rfc5549_vrf_tc50_p2 History
Topo Tests Part 2 on Ubuntu 18.04 arm8 < 1 sec
test setup failure
E   InvalidCLIError: % interface lo not in RED vrf
    line 4: Failure to communicate[13] to zebra, line: interface lo vrf RED 
    
    line 5: % Unknown command[4]: ip address 1.0.1.17/32
Collapse Failed test_rfc5549_red_default_vrf test_rfc5549_vrf_tc36_p0 History
Topo Tests Part 2 on Ubuntu 16.04 i386 < 1 sec
test setup failure
E   InvalidCLIError: % interface lo not in RED vrf
    line 4: Failure to communicate[13] to zebra, line: interface lo vrf RED 
    
    line 5: % Unknown command[4]: ip address 1.0.1.17/32
Collapse Failed test_rfc5549_red_default_vrf test_rfc5549_vrf_tc45_p0 History
Topo Tests Part 2 on Ubuntu 16.04 i386 < 1 sec
test setup failure
E   InvalidCLIError: % interface lo not in RED vrf
    line 4: Failure to communicate[13] to zebra, line: interface lo vrf RED 
    
    line 5: % Unknown command[4]: ip address 1.0.1.17/32
Collapse Failed test_rfc5549_red_default_vrf test_rfc5549_vrf_tc50_p2 History
Topo Tests Part 2 on Ubuntu 16.04 i386 < 1 sec
test setup failure
E   InvalidCLIError: % interface lo not in RED vrf
    line 4: Failure to communicate[13] to zebra, line: interface lo vrf RED 
    
    line 5: % Unknown command[4]: ip address 1.0.1.17/32
Collapse Failed test_rfc5549_red_default_vrf test_rfc5549_vrf_tc47_p0 History
Topo Tests Part 2 on Ubuntu 16.04 i386 5 secs
test setup failure
E   InvalidCLIError: % interface lo not in RED vrf
    line 4: Failure to communicate[13] to zebra, line: interface lo vrf RED 
    
    line 5: % Unknown command[4]: ip address 1.0.1.17/32
Collapse Failed test_rfc5549_red_default_vrf test_rfc5549_vrf_tc36_p0 History
Topo Tests Part 2 on Ubuntu 18.04 arm8 < 1 sec
test setup failure
E   InvalidCLIError: % interface lo not in RED vrf
    line 4: Failure to communicate[13] to zebra, line: interface lo vrf RED 
    
    line 5: % Unknown command[4]: ip address 1.0.1.17/32
Collapse Failed test_rfc5549_red_default_vrf test_rfc5549_vrf_tc45_p0 History
Topo Tests Part 2 on Ubuntu 18.04 arm8 < 1 sec
test setup failure
E   InvalidCLIError: % interface lo not in RED vrf
    line 4: Failure to communicate[13] to zebra, line: interface lo vrf RED 
    
    line 5: % Unknown command[4]: ip address 1.0.1.17/32
Collapse Failed test_rfc5549_red_default_vrf test_rfc5549_vrf_tc50_p2 History
Topo Tests Part 2 on Ubuntu 18.04 amd64 < 1 sec
test setup failure
E   InvalidCLIError: % interface lo not in RED vrf
    line 4: Failure to communicate[13] to zebra, line: interface lo vrf RED 
    
    line 5: % Unknown command[4]: ip address 1.0.1.17/32
Collapse Failed test_rfc5549_red_default_vrf_topo2 test_rfc5549_vrf_tc40_p1 History
Topo Tests Part 2 on Ubuntu 18.04 arm8 11 secs
test setup failure
E   InvalidCLIError: % interface lo not in RED vrf
    line 4: Failure to communicate[13] to zebra, line: interface lo vrf RED 
    
    line 5: % Unknown command[4]: ip address 1.0.1.17/32
Collapse Failed test_rfc5549_red_default_vrf_topo2 test_rfc5549_vrf_tc40_p1 History
Topo Tests Part 2 on Ubuntu 16.04 i386 5 secs
test setup failure
E   InvalidCLIError: % interface lo not in RED vrf
    line 4: Failure to communicate[13] to zebra, line: interface lo vrf RED 
    
    line 5: % Unknown command[4]: ip address 1.0.1.17/32
Collapse Failed test_rfc5549_red_default_vrf_topo2 test_rfc5549_vrf_tc40_p1 History
Topo Tests Part 2 on Ubuntu 18.04 amd64 5 secs
test setup failure
E   InvalidCLIError: % interface lo not in RED vrf
    line 4: Failure to communicate[13] to zebra, line: interface lo vrf RED 
    
    line 5: % Unknown command[4]: ip address 1.0.1.17/32
Collapse Failed test_rfc5549_red_default_vrf_topo2 test_rfc5549_vrf_tc40_p1 History
Topo Tests Part 2 on Ubuntu 16.04 amd64 5 secs
test setup failure
E   InvalidCLIError: % interface lo not in RED vrf
    line 4: Failure to communicate[13] to zebra, line: interface lo vrf RED 
    
    line 5: % Unknown command[4]: ip address 1.0.1.17/32
Collapse Failed test_rfc5549_red_ipv4_ipv6_nbrs test_rfc5549_ipv4_ipv6_nbr_adv_same_rte_tc41_p1 History
Topo Tests Part 2 on Ubuntu 18.04 arm8 13 secs
test setup failure
E   InvalidCLIError: % interface lo not in RED vrf
    line 4: Failure to communicate[13] to zebra, line: interface lo vrf RED 
    
    line 5: % Unknown command[4]: ip address 1.0.2.17/32 
    line 6: % Unknown command[4]: ipv6 address 2001:DB8:F::2:17/128
Collapse Failed test_rfc5549_red_ipv4_ipv6_nbrs test_rfc5549_ipv4_ipv6_nbr_adv_same_rte_tc41_p1 History
Topo Tests Part 2 on Ubuntu 18.04 amd64 6 secs
test setup failure
E   InvalidCLIError: % interface lo not in RED vrf
    line 4: Failure to communicate[13] to zebra, line: interface lo vrf RED 
    
    line 5: % Unknown command[4]: ip address 1.0.2.17/32 
    line 6: % Unknown command[4]: ipv6 address 2001:DB8:F::2:17/128

Jira issues

IssueDescriptionStatus
Unknown Issue TypeFRR-7Could not obtain issue details from Jira