FreeRangeRouting Github Pull Request Testing

Build: #14223 failed Custom build by Github Hook with revision master

Build result summary

Details

Completed
Duration
186 minutes
Flags
Custom revisionCustom build
Labels
version=frr-7_4-dev-2682-ge5cd7b487git=https_//github_com/frrouting/frr_gitbuildurl=https_//ci1_netdef_org/browse/frr-frrpullreq-14223branch=master
Revision
32e3ca2bccc3bbef1a95ba57a73fdd39ad7f13b1 32e3ca2bccc3bbef1a95ba57a73fdd39ad7f13b1
Total tests
9083
Fixed in
#14224 (Custom build by Github Hook with revision master)

Tests

Custom variables

Custom revision
32e3ca2bccc3bbef1a95ba57a73fdd39ad7f13b1 32e3ca2bccc3bbef1a95ba57a73fdd39ad7f13b1
Name Value
github_base_sha 32e3ca2bccc3bbef1a95ba57a73fdd39ad7f13b1
github_pullreq 6904
github_repo FRRouting/frr
github_merge_sha e5cd7b48780ca6fc12906ec661236e83d0da00a6
github_branch master

Comments

  1. Github Hook

    GitHub Merge Request 6904
    for GitHub Repo FRRouting/frr, branch master

    Request to merge from chiragshah6/frr
    Merge Git Commit ID e5cd7b48780ca6fc12906ec661236e83d0da00a6 on top of base Git Commit ID 32e3ca2bccc3bbef1a95ba57a73fdd39ad7f13b1

Comments on AddressSanitizer Topotests Part 1

  1. Anonymous user

    Detected hung build state. Attempting to generate stack trace and terminate spawned sub-processes.

Comments on Topo Tests Part 1 on Ubuntu 16.04 amd64

  1. Anonymous user

    Detected hung build state. Attempting to generate stack trace and terminate spawned sub-processes.

Comments on Topo Tests Part 1 on Ubuntu 16.04 i386

  1. Anonymous user

    Detected hung build state. Attempting to generate stack trace and terminate spawned sub-processes.

Comments on Topo Tests Part 1 on Ubuntu 18.04 amd64

  1. Anonymous user

    Detected hung build state. Attempting to generate stack trace and terminate spawned sub-processes.

Comments on Topo Tests Part 1 on Ubuntu 18.04 arm8

  1. Anonymous user

    Detected hung build state. Attempting to generate stack trace and terminate spawned sub-processes.

Code commits

Author Commit Message Commit date
Donald Sharp Donald Sharp 32e3ca2bccc3bbef1a95ba57a73fdd39ad7f13b1 32e3ca2bccc3bbef1a95ba57a73fdd39ad7f13b1 Merge pull request #7103 from opensourcerouting/sysrepo-fixes
lib: sysrepo plugin fixes

Tests

New test failures 207
Status Test View job Duration
Collapse Failed test_bfd_topo3 test_wait_bgp_convergence History
Topo Tests Part 0 on Ubuntu 18.04 arm8 3 mins
AssertionError: "r1" OSPF convergence failure assert Generated JSON diff error report:      > $: d2 has key '10.254.254.3/32' which is not present in d1
E   AssertionError: "r1" OSPF convergence failure
    assert Generated JSON diff error report:
      
      > $: d2 has key '10.254.254.3/32' which is not present in d1
Collapse Failed test_bfd_topo3 test_wait_bgp_convergence History
Topo Tests Part 0 on Ubuntu 16.04 amd64 2 mins
AssertionError: "r1" OSPF convergence failure assert Generated JSON diff error report:      > $: d2 has key '10.254.254.3/32' which is not present in d1
E   AssertionError: "r1" OSPF convergence failure
    assert Generated JSON diff error report:
      
      > $: d2 has key '10.254.254.3/32' which is not present in d1
Collapse Failed test_bfd_topo3 test_wait_bgp_convergence History
Topo Tests Part 0 on Ubuntu 16.04 i386 2 mins
AssertionError: "r1" OSPF convergence failure assert Generated JSON diff error report:      > $: d2 has key '10.254.254.3/32' which is not present in d1
E   AssertionError: "r1" OSPF convergence failure
    assert Generated JSON diff error report:
      
      > $: d2 has key '10.254.254.3/32' which is not present in d1
Collapse Failed test_bfd_topo3 test_wait_bgp_convergence History
Topo Tests Part 0 on Ubuntu 18.04 amd64 2 mins
AssertionError: "r1" OSPF convergence failure assert Generated JSON diff error report:      > $: d2 has key '10.254.254.3/32' which is not present in d1
E   AssertionError: "r1" OSPF convergence failure
    assert Generated JSON diff error report:
      
      > $: d2 has key '10.254.254.3/32' which is not present in d1
Collapse Failed test_bgp_features test_bgp_shutdown_message History
Topo Tests Part 2 on Ubuntu 16.04 amd64 < 1 sec
AssertionError: BGP shutdown message not received on router R2 assert '' != ''
E   AssertionError: BGP shutdown message not received on router R2
    assert '' != ''
Collapse Failed test_bgp_features test_bgp_shutdown_message History
Topo Tests Part 2 on Ubuntu 18.04 arm8 1 sec
AssertionError: BGP shutdown message not received on router R2 assert '' != ''
E   AssertionError: BGP shutdown message not received on router R2
    assert '' != ''
Collapse Failed test_bgp_features test_bgp_shutdown_message History
Topo Tests Part 2 on Ubuntu 16.04 i386 1 sec
AssertionError: BGP shutdown message not received on router R2 assert '' != ''
E   AssertionError: BGP shutdown message not received on router R2
    assert '' != ''
Collapse Failed test_bgp_features test_bgp_shutdown_message History
Topo Tests Part 2 on Ubuntu 18.04 amd64 < 1 sec
AssertionError: BGP shutdown message not received on router R2 assert '' != ''
E   AssertionError: BGP shutdown message not received on router R2
    assert '' != ''
Collapse Failed test_bgp_instance_del_test test_check_routes History
Topo Tests Part 2 on Ubuntu 18.04 arm8 1 min
AssertionError: 23 tests failed
E   AssertionError: 23 tests failed
Collapse Failed test_bgp_instance_del_test test_check_routes History
Topo Tests Part 2 on Ubuntu 16.04 amd64 1 min
AssertionError: 23 tests failed
E   AssertionError: 23 tests failed
Collapse Failed test_bgp_instance_del_test test_check_routes History
Topo Tests Part 2 on Ubuntu 18.04 amd64 1 min
AssertionError: 23 tests failed
E   AssertionError: 23 tests failed
Collapse Failed test_bgp_instance_del_test test_check_routes History
Topo Tests Part 2 on Ubuntu 16.04 i386 1 min
AssertionError: 23 tests failed
E   AssertionError: 23 tests failed
Collapse Failed test_bgp_ipv6_rtadv test_protocols_convergence History
Topo Tests Part 2 on Ubuntu 18.04 arm8 2 mins
AssertionError: "r1" JSON output mismatches assert Generated JSON diff error report:      > $: d2 has key '10.254.254.2/32' which is not present in d1
E   AssertionError: "r1" JSON output mismatches
    assert Generated JSON diff error report:
      
      > $: d2 has key '10.254.254.2/32' which is not present in d1
Collapse Failed test_bgp_ipv6_rtadv test_protocols_convergence History
Topo Tests Part 2 on Ubuntu 16.04 i386 1 min
AssertionError: "r1" JSON output mismatches assert Generated JSON diff error report:      > $: d2 has key '10.254.254.2/32' which is not present in d1
E   AssertionError: "r1" JSON output mismatches
    assert Generated JSON diff error report:
      
      > $: d2 has key '10.254.254.2/32' which is not present in d1
Collapse Failed test_bgp_ipv6_rtadv test_protocols_convergence History
Topo Tests Part 2 on Ubuntu 16.04 amd64 1 min
AssertionError: "r1" JSON output mismatches assert Generated JSON diff error report:      > $: d2 has key '10.254.254.2/32' which is not present in d1
E   AssertionError: "r1" JSON output mismatches
    assert Generated JSON diff error report:
      
      > $: d2 has key '10.254.254.2/32' which is not present in d1
Collapse Failed test_bgp_ipv6_rtadv test_protocols_convergence History
Topo Tests Part 2 on Ubuntu 18.04 amd64 1 min
AssertionError: "r1" JSON output mismatches assert Generated JSON diff error report:      > $: d2 has key '10.254.254.2/32' which is not present in d1
E   AssertionError: "r1" JSON output mismatches
    assert Generated JSON diff error report:
      
      > $: d2 has key '10.254.254.2/32' which is not present in d1
Collapse Failed test_bgp_l3vpn_to_bgp_direct test_add_routes History
Topo Tests Part 2 on Ubuntu 16.04 i386 3 mins
AssertionError: 15 tests failed
E   AssertionError: 15 tests failed
Collapse Failed test_bgp_l3vpn_to_bgp_direct test_add_routes History
Topo Tests Part 2 on Ubuntu 18.04 arm8 4 mins
AssertionError: 15 tests failed
E   AssertionError: 15 tests failed
Collapse Failed test_bgp_l3vpn_to_bgp_direct test_add_routes History
Topo Tests Part 2 on Ubuntu 16.04 amd64 3 mins
AssertionError: 15 tests failed
E   AssertionError: 15 tests failed
Collapse Failed test_bgp_l3vpn_to_bgp_direct test_add_routes History
Topo Tests Part 2 on Ubuntu 18.04 amd64 3 mins
AssertionError: 15 tests failed
E   AssertionError: 15 tests failed
Collapse Failed test_bgp_l3vpn_to_bgp_vrf test_check_routes History
Topo Tests Part 2 on Ubuntu 18.04 amd64 1 min
AssertionError: 23 tests failed
E   AssertionError: 23 tests failed
Collapse Failed test_bgp_l3vpn_to_bgp_vrf test_check_routes History
Topo Tests Part 2 on Ubuntu 16.04 i386 1 min
AssertionError: 23 tests failed
E   AssertionError: 23 tests failed
Collapse Failed test_bgp_l3vpn_to_bgp_vrf test_check_routes History
Topo Tests Part 2 on Ubuntu 16.04 amd64 1 min
AssertionError: 23 tests failed
E   AssertionError: 23 tests failed
Collapse Failed test_bgp_l3vpn_to_bgp_vrf test_check_routes History
Topo Tests Part 2 on Ubuntu 18.04 arm8 1 min
AssertionError: 23 tests failed
E   AssertionError: 23 tests failed
Collapse Failed test_bgp_large_community_topo_1 test_large_community_advertise History
Topo Tests Part 2 on Ubuntu 18.04 amd64 41 secs
AssertionError: Test case test_large_community_advertise : Failed     Error: Prefix 200.50.2.0 not found in BGP table of router: r2 assert 'Prefix 200.50.2.0 not found in BGP table of router: r2' is True
E   AssertionError: Test case test_large_community_advertise : Failed 
       Error: Prefix 200.50.2.0 not found in BGP table of router: r2
    assert 'Prefix 200.50.2.0 not found in BGP table of router: r2' is True
Collapse Failed test_bgp_large_community_topo_1 test_large_community_advertise History
Topo Tests Part 2 on Ubuntu 16.04 amd64 41 secs
AssertionError: Test case test_large_community_advertise : Failed     Error: Prefix 200.50.2.0 not found in BGP table of router: r2 assert 'Prefix 200.50.2.0 not found in BGP table of router: r2' is True
E   AssertionError: Test case test_large_community_advertise : Failed 
       Error: Prefix 200.50.2.0 not found in BGP table of router: r2
    assert 'Prefix 200.50.2.0 not found in BGP table of router: r2' is True
Collapse Failed test_bgp_large_community_topo_1 test_large_community_advertise History
Topo Tests Part 2 on Ubuntu 18.04 arm8 1 min
AssertionError: Test case test_large_community_advertise : Failed     Error: Prefix 200.50.2.0 not found in BGP table of router: r2 assert 'Prefix 200.50.2.0 not found in BGP table of router: r2' is True
E   AssertionError: Test case test_large_community_advertise : Failed 
       Error: Prefix 200.50.2.0 not found in BGP table of router: r2
    assert 'Prefix 200.50.2.0 not found in BGP table of router: r2' is True
Collapse Failed test_bgp_large_community_topo_1 test_large_community_advertise History
Topo Tests Part 2 on Ubuntu 16.04 i386 52 secs
AssertionError: Test case test_large_community_advertise : Failed     Error: Prefix 200.50.2.0 not found in BGP table of router: r2 assert 'Prefix 200.50.2.0 not found in BGP table of router: r2' is True
E   AssertionError: Test case test_large_community_advertise : Failed 
       Error: Prefix 200.50.2.0 not found in BGP table of router: r2
    assert 'Prefix 200.50.2.0 not found in BGP table of router: r2' is True
Collapse Failed test_bgp_large_community_topo_2 test_modify_large_community_lists_referenced_by_rmap History
Topo Tests Part 2 on Ubuntu 18.04 amd64 48 secs
AssertionError: Testcase test_modify_large_community_lists_referenced_by_rmap : Failed     Error: Prefix 200.50.2.0/32 not found in BGP table of router: r4 assert 'Prefix 200.50.2.0/32 not found in BGP table of router: r4' is True
E   AssertionError: Testcase test_modify_large_community_lists_referenced_by_rmap : Failed 
       Error: Prefix 200.50.2.0/32 not found in BGP table of router: r4
    assert 'Prefix 200.50.2.0/32 not found in BGP table of router: r4' is True
Collapse Failed test_bgp_large_community_topo_2 test_modify_large_community_lists_referenced_by_rmap History
Topo Tests Part 2 on Ubuntu 18.04 arm8 1 min
AssertionError: Testcase test_modify_large_community_lists_referenced_by_rmap : Failed     Error: Prefix 200.50.2.0/32 not found in BGP table of router: r4 assert 'Prefix 200.50.2.0/32 not found in BGP table of router: r4' is True
E   AssertionError: Testcase test_modify_large_community_lists_referenced_by_rmap : Failed 
       Error: Prefix 200.50.2.0/32 not found in BGP table of router: r4
    assert 'Prefix 200.50.2.0/32 not found in BGP table of router: r4' is True
Collapse Failed test_bgp_large_community_topo_2 test_modify_large_community_lists_referenced_by_rmap History
Topo Tests Part 2 on Ubuntu 16.04 amd64 48 secs
AssertionError: Testcase test_modify_large_community_lists_referenced_by_rmap : Failed     Error: Prefix 200.50.2.0/32 not found in BGP table of router: r4 assert 'Prefix 200.50.2.0/32 not found in BGP table of router: r4' is True
E   AssertionError: Testcase test_modify_large_community_lists_referenced_by_rmap : Failed 
       Error: Prefix 200.50.2.0/32 not found in BGP table of router: r4
    assert 'Prefix 200.50.2.0/32 not found in BGP table of router: r4' is True
Collapse Failed test_bgp_large_community_topo_2 test_modify_large_community_lists_referenced_by_rmap History
Topo Tests Part 2 on Ubuntu 16.04 i386 1 min
AssertionError: Testcase test_modify_large_community_lists_referenced_by_rmap : Failed     Error: Prefix 200.50.2.0/32 not found in BGP table of router: r4 assert 'Prefix 200.50.2.0/32 not found in BGP table of router: r4' is True
E   AssertionError: Testcase test_modify_large_community_lists_referenced_by_rmap : Failed 
       Error: Prefix 200.50.2.0/32 not found in BGP table of router: r4
    assert 'Prefix 200.50.2.0/32 not found in BGP table of router: r4' is True
Collapse Failed test_bgp_linkbw_ip test_bgp_linkbw_adv History
Topo Tests Part 2 on Ubuntu 18.04 amd64 2 mins
AssertionError: JSON output mismatch on spine router r2 assert Generated JSON diff error report:      > $: d2 has key 'paths' which is not present in d1   > $: d2 has key 'prefix' which is not present in d1
E   AssertionError: JSON output mismatch on spine router r2
    assert Generated JSON diff error report:
      
      > $: d2 has key 'paths' which is not present in d1
      > $: d2 has key 'prefix' which is not present in d1
Collapse Failed test_bgp_linkbw_ip test_bgp_linkbw_adv History
Topo Tests Part 2 on Ubuntu 16.04 i386 2 mins
AssertionError: JSON output mismatch on spine router r2 assert Generated JSON diff error report:      > $: d2 has key 'paths' which is not present in d1   > $: d2 has key 'prefix' which is not present in d1
E   AssertionError: JSON output mismatch on spine router r2
    assert Generated JSON diff error report:
      
      > $: d2 has key 'paths' which is not present in d1
      > $: d2 has key 'prefix' which is not present in d1
Collapse Failed test_bgp_linkbw_ip test_bgp_linkbw_adv History
Topo Tests Part 2 on Ubuntu 18.04 arm8 3 mins
AssertionError: JSON output mismatch on spine router r2 assert Generated JSON diff error report:      > $: d2 has key 'paths' which is not present in d1   > $: d2 has key 'prefix' which is not present in d1
E   AssertionError: JSON output mismatch on spine router r2
    assert Generated JSON diff error report:
      
      > $: d2 has key 'paths' which is not present in d1
      > $: d2 has key 'prefix' which is not present in d1
Collapse Failed test_bgp_linkbw_ip test_bgp_linkbw_adv History
Topo Tests Part 2 on Ubuntu 16.04 amd64 2 mins
AssertionError: JSON output mismatch on spine router r2 assert Generated JSON diff error report:      > $: d2 has key 'paths' which is not present in d1   > $: d2 has key 'prefix' which is not present in d1
E   AssertionError: JSON output mismatch on spine router r2
    assert Generated JSON diff error report:
      
      > $: d2 has key 'paths' which is not present in d1
      > $: d2 has key 'prefix' which is not present in d1
Collapse Failed test_bgp_local_as_private_remove test_bgp_remove_private_as History
Topo Tests Part 2 on Ubuntu 18.04 amd64 8 secs
KeyError: 'prefix'
E   KeyError: 'prefix'
Collapse Failed test_bgp_local_as_private_remove test_bgp_remove_private_as History
Topo Tests Part 2 on Ubuntu 18.04 arm8 13 secs
KeyError: 'prefix'
E   KeyError: 'prefix'
Collapse Failed test_bgp_local_as_private_remove test_bgp_remove_private_as History
Topo Tests Part 2 on Ubuntu 16.04 amd64 7 secs
KeyError: 'prefix'
E   KeyError: 'prefix'
Collapse Failed test_bgp_local_as_private_remove test_bgp_remove_private_as History
Topo Tests Part 2 on Ubuntu 16.04 i386 9 secs
KeyError: 'prefix'
E   KeyError: 'prefix'
Collapse Failed test_bgp_maximum_prefix_out test_bgp_maximum_prefix_out History
Topo Tests Part 2 on Ubuntu 18.04 amd64 43 secs
AssertionError: Failed bgp convergence in "TopoGear<name="r2",links=["r2-eth0"<->"s1-eth1"]> TopoRouter<>" assert Generated JSON diff error report:      > $->192.168.255.2->addressFamilyInfo->ipv4Unicast->acceptedPrefixCounter: d1 has element with value '0' but in d2 it has value '2'
E   AssertionError: Failed bgp convergence in "TopoGear<name="r2",links=["r2-eth0"<->"s1-eth1"]> TopoRouter<>"
    assert Generated JSON diff error report:
      
      > $->192.168.255.2->addressFamilyInfo->ipv4Unicast->acceptedPrefixCounter: d1 has element with value '0' but in d2 it has value '2'
Collapse Failed test_bgp_maximum_prefix_out test_bgp_maximum_prefix_out History
Topo Tests Part 2 on Ubuntu 16.04 i386 46 secs
AssertionError: Failed bgp convergence in "TopoGear<name="r2",links=["r2-eth0"<->"s1-eth1"]> TopoRouter<>" assert Generated JSON diff error report:      > $->192.168.255.2->addressFamilyInfo->ipv4Unicast->acceptedPrefixCounter: d1 has element with value '0' but in d2 it has value '2'
E   AssertionError: Failed bgp convergence in "TopoGear<name="r2",links=["r2-eth0"<->"s1-eth1"]> TopoRouter<>"
    assert Generated JSON diff error report:
      
      > $->192.168.255.2->addressFamilyInfo->ipv4Unicast->acceptedPrefixCounter: d1 has element with value '0' but in d2 it has value '2'
Collapse Failed test_bgp_maximum_prefix_out test_bgp_maximum_prefix_out History
Topo Tests Part 2 on Ubuntu 18.04 arm8 56 secs
AssertionError: Failed bgp convergence in "TopoGear<name="r2",links=["r2-eth0"<->"s1-eth1"]> TopoRouter<>" assert Generated JSON diff error report:      > $->192.168.255.2->addressFamilyInfo->ipv4Unicast->acceptedPrefixCounter: d1 has element with value '0' but in d2 it has value '2'
E   AssertionError: Failed bgp convergence in "TopoGear<name="r2",links=["r2-eth0"<->"s1-eth1"]> TopoRouter<>"
    assert Generated JSON diff error report:
      
      > $->192.168.255.2->addressFamilyInfo->ipv4Unicast->acceptedPrefixCounter: d1 has element with value '0' but in d2 it has value '2'
Collapse Failed test_bgp_maximum_prefix_out test_bgp_maximum_prefix_out History
Topo Tests Part 2 on Ubuntu 16.04 amd64 42 secs
AssertionError: Failed bgp convergence in "TopoGear<name="r2",links=["r2-eth0"<->"s1-eth1"]> TopoRouter<>" assert Generated JSON diff error report:      > $->192.168.255.2->addressFamilyInfo->ipv4Unicast->acceptedPrefixCounter: d1 has element with value '0' but in d2 it has value '2'
E   AssertionError: Failed bgp convergence in "TopoGear<name="r2",links=["r2-eth0"<->"s1-eth1"]> TopoRouter<>"
    assert Generated JSON diff error report:
      
      > $->192.168.255.2->addressFamilyInfo->ipv4Unicast->acceptedPrefixCounter: d1 has element with value '0' but in d2 it has value '2'
Collapse Failed test_bgp_multiview_topo1 test_bgp_routingTable History
Topo Tests Part 2 on Ubuntu 16.04 i386 < 1 sec
AssertionError: Routing Table verification failed for router r1, view 1: No template matched. template /root/bamboo-agent-home/xml-data/build-dir/FRR-FRRPULLREQ-TP2U1604I386/topotests/bgp_multiview_topo1/r1/show_ip_bgp_view_1.ref: r1 failed Routing Table Check for view 1: --- actual BGP routing table +++ expected BGP routing table @@ -1,9 +1,40 @@ -BGP table version is XXX, local router ID is 172.30.1.1, vrf id - -Default local pref 100, local AS 100 -Status codes:  s suppressed, d damped, h history, * valid, > best, = multipath, -               i internal, r RIB-failure, S Stale, R Removed -Nexthop codes: @NNN nexthop's vrf id, < announce-nh-self -Origin codes:  i - IGP, e - EGP, ? - incomplete +BGP table version is XXX, local router ID is 172.30.1.1 +Status codes: s suppressed, d damped, h history, * valid, > best, = multipath, +              i internal, r RIB-failure, S Stale, R Removed +Origin codes: i - IGP, e - EGP, ? - incomplete       Network          Next Hop            Metric LocPrf Weight Path +*  10.0.1.0/24      172.16.1.5                             0 65005 i +*                   172.16.1.2                             0 65002 i +*>                  172.16.1.1                             0 65001 i +*> 10.101.0.0/24    172.16.1.1             100              0 65001 i +*> 10.101.1.0/24    172.16.1.1             100              0 65001 i +*> 10.101.2.0/24    172.16.1.1             100              0 65001 i +*> 10.101.3.0/24    172.16.1.1             100              0 65001 i +*> 10.101.4.0/24    172.16.1.1             100              0 65001 i +*> 10.101.5.0/24    172.16.1.1             100              0 65001 i +*> 10.101.6.0/24    172.16.1.1             100              0 65001 i +*> 10.101.7.0/24    172.16.1.1             100              0 65001 i +*> 10.101.8.0/24    172.16.1.1             100              0 65001 i +*> 10.101.9.0/24    172.16.1.1             100              0 65001 i +*> 10.102.0.0/24    172.16.1.2             100              0 65002 i +*> 10.102.1.0/24    172.16.1.2             100              0 65002 i +*> 10.102.2.0/24    172.16.1.2             100              0 65002 i +*> 10.102.3.0/24    172.16.1.2             100              0 65002 i +*> 10.102.4.0/24    172.16.1.2             100              0 65002 i +*> 10.102.5.0/24    172.16.1.2             100              0 65002 i +*> 10.102.6.0/24    172.16.1.2             100              0 65002 i +*> 10.102.7.0/24    172.16.1.2             100              0 65002 i +*> 10.102.8.0/24    172.16.1.2             100              0 65002 i +*> 10.102.9.0/24    172.16.1.2             100              0 65002 i +*> 10.105.0.0/24    172.16.1.5             100              0 65005 i +*> 10.105.1.0/24    172.16.1.5             100              0 65005 i +*> 10.105.2.0/24    172.16.1.5             100              0 65005 i +*> 10.105.3.0/24    172.16.1.5             100              0 65005 i +*> 10.105.4.0/24    172.16.1.5             100              0 65005 i +*> 10.105.5.0/24    172.16.1.5             100              0 65005 i +*> 10.105.6.0/24    172.16.1.5             100              0 65005 i +*> 10.105.7.0/24    172.16.1.5             100              0 65005 i +*> 10.105.8.0/24    172.16.1.5             100              0 65005 i +*> 10.105.9.0/24    172.16.1.5             100              0 65005 i  *> 172.20.0.0/28    0.0.0.0                  0          32768 i template /root/bamboo-agent-home/xml-data/build-dir/FRR-FRRPULLREQ-TP2U1604I386/topotests/bgp_multiview_topo1/r1/show_ip_bgp_view_1-post6.1.ref: r1 failed Routing Table Check for view 1: --- actual BGP routing table +++ expected BGP routing table @@ -6,4 +6,37 @@  Origin codes:  i - IGP, e - EGP, ? - incomplete       Network          Next Hop            Metric LocPrf Weight Path +*  10.0.1.0/24      172.16.1.5                             0 65005 i +*                   172.16.1.2                             0 65002 i +*>                  172.16.1.1                             0 65001 i +*> 10.101.0.0/24    172.16.1.1             100              0 65001 i +*> 10.101.1.0/24    172.16.1.1             100              0 65001 i +*> 10.101.2.0/24    172.16.1.1             100              0 65001 i +*> 10.101.3.0/24    172.16.1.1             100              0 65001 i +*> 10.101.4.0/24    172.16.1.1             100              0 65001 i +*> 10.101.5.0/24    172.16.1.1             100              0 65001 i +*> 10.101.6.0/24    172.16.1.1             100              0 65001 i +*> 10.101.7.0/24    172.16.1.1             100              0 65001 i +*> 10.101.8.0/24    172.16.1.1             100              0 65001 i +*> 10.101.9.0/24    172.16.1.1             100              0 65001 i +*> 10.102.0.0/24    172.16.1.2             100              0 65002 i +*> 10.102.1.0/24    172.16.1.2             100              0 65002 i +*> 10.102.2.0/24    172.16.1.2             100              0 65002 i +*> 10.102.3.0/24    172.16.1.2             100              0 65002 i +*> 10.102.4.0/24    172.16.1.2             100              0 65002 i +*> 10.102.5.0/24    172.16.1.2             100              0 65002 i +*> 10.102.6.0/24    172.16.1.2             100              0 65002 i +*> 10.102.7.0/24    172.16.1.2             100              0 65002 i +*> 10.102.8.0/24    172.16.1.2             100              0 65002 i +*> 10.102.9.0/24    172.16.1.2             100              0 65002 i +*> 10.105.0.0/24    172.16.1.5             100              0 65005 i +*> 10.105.1.0/24    172.16.1.5             100              0 65005 i +*> 10.105.2.0/24    172.16.1.5             100              0 65005 i +*> 10.105.3.0/24    172.16.1.5             100              0 65005 i +*> 10.105.4.0/24    172.16.1.5             100              0 65005 i +*> 10.105.5.0/24    172.16.1.5             100              0 65005 i +*> 10.105.6.0/24    172.16.1.5             100              0 65005 i +*> 10.105.7.0/24    172.16.1.5             100              0 65005 i +*> 10.105.8.0/24    172.16.1.5             100              0 65005 i +*> 10.105.9.0/24    172.16.1.5             100              0 65005 i  *> 172.20.0.0/28    0.0.0.0                  0          32768 i template /root/bamboo-agent-home/xml-data/build-dir/FRR-FRRPULLREQ-TP2U1604I386/topotests/bgp_multiview_topo1/r1/show_ip_bgp_view_1-post4.1.ref: r1 failed Routing Table Check for view 1: --- actual BGP routing table +++ expected BGP routing table @@ -1,9 +1,41 @@  BGP table version is XXX, local router ID is 172.30.1.1, vrf id - -Default local pref 100, local AS 100  Status codes:  s suppressed, d damped, h history, * valid, > best, = multipath,                 i internal, r RIB-failure, S Stale, R Removed  Nexthop codes: @NNN nexthop's vrf id, < announce-nh-self  Origin codes:  i - IGP, e - EGP, ? - incomplete       Network          Next Hop            Metric LocPrf Weight Path +*  10.0.1.0/24      172.16.1.5                             0 65005 i +*                   172.16.1.2                             0 65002 i +*>                  172.16.1.1                             0 65001 i +*> 10.101.0.0/24    172.16.1.1             100              0 65001 i +*> 10.101.1.0/24    172.16.1.1             100              0 65001 i +*> 10.101.2.0/24    172.16.1.1             100              0 65001 i +*> 10.101.3.0/24    172.16.1.1             100              0 65001 i +*> 10.101.4.0/24    172.16.1.1             100              0 65001 i +*> 10.101.5.0/24    172.16.1.1             100              0 65001 i +*> 10.101.6.0/24    172.16.1.1             100              0 65001 i +*> 10.101.7.0/24    172.16.1.1             100              0 65001 i +*> 10.101.8.0/24    172.16.1.1             100              0 65001 i +*> 10.101.9.0/24    172.16.1.1             100              0 65001 i +*> 10.102.0.0/24    172.16.1.2             100              0 65002 i +*> 10.102.1.0/24    172.16.1.2             100              0 65002 i +*> 10.102.2.0/24    172.16.1.2             100              0 65002 i +*> 10.102.3.0/24    172.16.1.2             100              0 65002 i +*> 10.102.4.0/24    172.16.1.2             100              0 65002 i +*> 10.102.5.0/24    172.16.1.2             100              0 65002 i +*> 10.102.6.0/24    172.16.1.2             100              0 65002 i +*> 10.102.7.0/24    172.16.1.2             100              0 65002 i +*> 10.102.8.0/24    172.16.1.2             100              0 65002 i +*> 10.102.9.0/24    172.16.1.2             100              0 65002 i +*> 10.105.0.0/24    172.16.1.5             100              0 65005 i +*> 10.105.1.0/24    172.16.1.5             100              0 65005 i +*> 10.105.2.0/24    172.16.1.5             100              0 65005 i +*> 10.105.3.0/24    172.16.1.5             100              0 65005 i +*> 10.105.4.0/24    172.16.1.5             100              0 65005 i +*> 10.105.5.0/24    172.16.1.5             100              0 65005 i +*> 10.105.6.0/24    172.16.1.5             100              0 65005 i +*> 10.105.7.0/24    172.16.1.5             100              0 65005 i +*> 10.105.8.0/24    172.16.1.5             100              0 65005 i +*> 10.105.9.0/24    172.16.1.5             100              0 65005 i  *> 172.20.0.0/28    0.0.0.0                  0          32768 i
E   AssertionError: Routing Table verification failed for router r1, view 1:
    No template matched.
    template /root/bamboo-agent-home/xml-data/build-dir/FRR-FRRPULLREQ-TP2U1604I386/topotests/bgp_multiview_topo1/r1/show_ip_bgp_view_1.ref: r1 failed Routing Table Check for view 1:
    --- actual BGP routing table
    +++ expected BGP routing table
    @@ -1,9 +1,40 @@
    -BGP table version is XXX, local router ID is 172.30.1.1, vrf id -
(132 more lines...)
Collapse Failed test_bgp_multiview_topo1 test_bgp_converge History
Topo Tests Part 2 on Ubuntu 18.04 amd64 2 mins
AssertionError: BGP did not converge:      IPv4 Unicast Summary:   BGP router identifier 172.30.1.1, local AS number 100 vrf-id -1   BGP table version 1   RIB entries 1, using 192 bytes of memory   Peers 3, using 64 KiB of memory      Neighbor        V         AS   MsgRcvd   MsgSent   TblVer  InQ OutQ  Up/Down State/PfxRcd   PfxSnt   172.16.1.1      4      65001        56        45        0    0    0 00:02:08     (Policy) (Policy)   172.16.1.2      4      65002        56        45        0    0    0 00:02:08     (Policy) (Policy)   172.16.1.5      4      65005        56        45        0    0    0 00:02:07     (Policy) (Policy)      Total number of neighbors 3    assert False
E   AssertionError: BGP did not converge:
      
      IPv4 Unicast Summary:
      BGP router identifier 172.30.1.1, local AS number 100 vrf-id -1
      BGP table version 1
      RIB entries 1, using 192 bytes of memory
      Peers 3, using 64 KiB of memory
(9 more lines...)
Collapse Failed test_bgp_multiview_topo1 test_bgp_converge History
Topo Tests Part 2 on Ubuntu 16.04 i386 2 mins
AssertionError: BGP did not converge:      IPv4 Unicast Summary:   BGP router identifier 172.30.1.1, local AS number 100 vrf-id -1   BGP table version 1   RIB entries 1, using 128 bytes of memory   Peers 3, using 53 KiB of memory      Neighbor        V         AS   MsgRcvd   MsgSent   TblVer  InQ OutQ  Up/Down State/PfxRcd   PfxSnt   172.16.1.1      4      65001        57        46        0    0    0 00:02:10     (Policy) (Policy)   172.16.1.2      4      65002        57        46        0    0    0 00:02:10     (Policy) (Policy)   172.16.1.5      4      65005        56        46        0    0    0 00:02:09     (Policy) (Policy)      Total number of neighbors 3    assert False
E   AssertionError: BGP did not converge:
      
      IPv4 Unicast Summary:
      BGP router identifier 172.30.1.1, local AS number 100 vrf-id -1
      BGP table version 1
      RIB entries 1, using 128 bytes of memory
      Peers 3, using 53 KiB of memory
(9 more lines...)
Collapse Failed test_bgp_multiview_topo1 test_bgp_routingTable History
Topo Tests Part 2 on Ubuntu 18.04 amd64 < 1 sec
AssertionError: Routing Table verification failed for router r1, view 1: No template matched. template /root/bamboo-agent-home/xml-data/build-dir/FRR-FRRPULLREQ-TP2U1804AMD64/topotests/bgp_multiview_topo1/r1/show_ip_bgp_view_1-post4.1.ref: r1 failed Routing Table Check for view 1: --- actual BGP routing table +++ expected BGP routing table @@ -1,9 +1,41 @@  BGP table version is XXX, local router ID is 172.30.1.1, vrf id - -Default local pref 100, local AS 100  Status codes:  s suppressed, d damped, h history, * valid, > best, = multipath,                 i internal, r RIB-failure, S Stale, R Removed  Nexthop codes: @NNN nexthop's vrf id, < announce-nh-self  Origin codes:  i - IGP, e - EGP, ? - incomplete       Network          Next Hop            Metric LocPrf Weight Path +*  10.0.1.0/24      172.16.1.5                             0 65005 i +*                   172.16.1.2                             0 65002 i +*>                  172.16.1.1                             0 65001 i +*> 10.101.0.0/24    172.16.1.1             100              0 65001 i +*> 10.101.1.0/24    172.16.1.1             100              0 65001 i +*> 10.101.2.0/24    172.16.1.1             100              0 65001 i +*> 10.101.3.0/24    172.16.1.1             100              0 65001 i +*> 10.101.4.0/24    172.16.1.1             100              0 65001 i +*> 10.101.5.0/24    172.16.1.1             100              0 65001 i +*> 10.101.6.0/24    172.16.1.1             100              0 65001 i +*> 10.101.7.0/24    172.16.1.1             100              0 65001 i +*> 10.101.8.0/24    172.16.1.1             100              0 65001 i +*> 10.101.9.0/24    172.16.1.1             100              0 65001 i +*> 10.102.0.0/24    172.16.1.2             100              0 65002 i +*> 10.102.1.0/24    172.16.1.2             100              0 65002 i +*> 10.102.2.0/24    172.16.1.2             100              0 65002 i +*> 10.102.3.0/24    172.16.1.2             100              0 65002 i +*> 10.102.4.0/24    172.16.1.2             100              0 65002 i +*> 10.102.5.0/24    172.16.1.2             100              0 65002 i +*> 10.102.6.0/24    172.16.1.2             100              0 65002 i +*> 10.102.7.0/24    172.16.1.2             100              0 65002 i +*> 10.102.8.0/24    172.16.1.2             100              0 65002 i +*> 10.102.9.0/24    172.16.1.2             100              0 65002 i +*> 10.105.0.0/24    172.16.1.5             100              0 65005 i +*> 10.105.1.0/24    172.16.1.5             100              0 65005 i +*> 10.105.2.0/24    172.16.1.5             100              0 65005 i +*> 10.105.3.0/24    172.16.1.5             100              0 65005 i +*> 10.105.4.0/24    172.16.1.5             100              0 65005 i +*> 10.105.5.0/24    172.16.1.5             100              0 65005 i +*> 10.105.6.0/24    172.16.1.5             100              0 65005 i +*> 10.105.7.0/24    172.16.1.5             100              0 65005 i +*> 10.105.8.0/24    172.16.1.5             100              0 65005 i +*> 10.105.9.0/24    172.16.1.5             100              0 65005 i  *> 172.20.0.0/28    0.0.0.0                  0          32768 i template /root/bamboo-agent-home/xml-data/build-dir/FRR-FRRPULLREQ-TP2U1804AMD64/topotests/bgp_multiview_topo1/r1/show_ip_bgp_view_1-post6.1.ref: r1 failed Routing Table Check for view 1: --- actual BGP routing table +++ expected BGP routing table @@ -6,4 +6,37 @@  Origin codes:  i - IGP, e - EGP, ? - incomplete       Network          Next Hop            Metric LocPrf Weight Path +*  10.0.1.0/24      172.16.1.5                             0 65005 i +*                   172.16.1.2                             0 65002 i +*>                  172.16.1.1                             0 65001 i +*> 10.101.0.0/24    172.16.1.1             100              0 65001 i +*> 10.101.1.0/24    172.16.1.1             100              0 65001 i +*> 10.101.2.0/24    172.16.1.1             100              0 65001 i +*> 10.101.3.0/24    172.16.1.1             100              0 65001 i +*> 10.101.4.0/24    172.16.1.1             100              0 65001 i +*> 10.101.5.0/24    172.16.1.1             100              0 65001 i +*> 10.101.6.0/24    172.16.1.1             100              0 65001 i +*> 10.101.7.0/24    172.16.1.1             100              0 65001 i +*> 10.101.8.0/24    172.16.1.1             100              0 65001 i +*> 10.101.9.0/24    172.16.1.1             100              0 65001 i +*> 10.102.0.0/24    172.16.1.2             100              0 65002 i +*> 10.102.1.0/24    172.16.1.2             100              0 65002 i +*> 10.102.2.0/24    172.16.1.2             100              0 65002 i +*> 10.102.3.0/24    172.16.1.2             100              0 65002 i +*> 10.102.4.0/24    172.16.1.2             100              0 65002 i +*> 10.102.5.0/24    172.16.1.2             100              0 65002 i +*> 10.102.6.0/24    172.16.1.2             100              0 65002 i +*> 10.102.7.0/24    172.16.1.2             100              0 65002 i +*> 10.102.8.0/24    172.16.1.2             100              0 65002 i +*> 10.102.9.0/24    172.16.1.2             100              0 65002 i +*> 10.105.0.0/24    172.16.1.5             100              0 65005 i +*> 10.105.1.0/24    172.16.1.5             100              0 65005 i +*> 10.105.2.0/24    172.16.1.5             100              0 65005 i +*> 10.105.3.0/24    172.16.1.5             100              0 65005 i +*> 10.105.4.0/24    172.16.1.5             100              0 65005 i +*> 10.105.5.0/24    172.16.1.5             100              0 65005 i +*> 10.105.6.0/24    172.16.1.5             100              0 65005 i +*> 10.105.7.0/24    172.16.1.5             100              0 65005 i +*> 10.105.8.0/24    172.16.1.5             100              0 65005 i +*> 10.105.9.0/24    172.16.1.5             100              0 65005 i  *> 172.20.0.0/28    0.0.0.0                  0          32768 i template /root/bamboo-agent-home/xml-data/build-dir/FRR-FRRPULLREQ-TP2U1804AMD64/topotests/bgp_multiview_topo1/r1/show_ip_bgp_view_1.ref: r1 failed Routing Table Check for view 1: --- actual BGP routing table +++ expected BGP routing table @@ -1,9 +1,40 @@ -BGP table version is XXX, local router ID is 172.30.1.1, vrf id - -Default local pref 100, local AS 100 -Status codes:  s suppressed, d damped, h history, * valid, > best, = multipath, -               i internal, r RIB-failure, S Stale, R Removed -Nexthop codes: @NNN nexthop's vrf id, < announce-nh-self -Origin codes:  i - IGP, e - EGP, ? - incomplete +BGP table version is XXX, local router ID is 172.30.1.1 +Status codes: s suppressed, d damped, h history, * valid, > best, = multipath, +              i internal, r RIB-failure, S Stale, R Removed +Origin codes: i - IGP, e - EGP, ? - incomplete       Network          Next Hop            Metric LocPrf Weight Path +*  10.0.1.0/24      172.16.1.5                             0 65005 i +*                   172.16.1.2                             0 65002 i +*>                  172.16.1.1                             0 65001 i +*> 10.101.0.0/24    172.16.1.1             100              0 65001 i +*> 10.101.1.0/24    172.16.1.1             100              0 65001 i +*> 10.101.2.0/24    172.16.1.1             100              0 65001 i +*> 10.101.3.0/24    172.16.1.1             100              0 65001 i +*> 10.101.4.0/24    172.16.1.1             100              0 65001 i +*> 10.101.5.0/24    172.16.1.1             100              0 65001 i +*> 10.101.6.0/24    172.16.1.1             100              0 65001 i +*> 10.101.7.0/24    172.16.1.1             100              0 65001 i +*> 10.101.8.0/24    172.16.1.1             100              0 65001 i +*> 10.101.9.0/24    172.16.1.1             100              0 65001 i +*> 10.102.0.0/24    172.16.1.2             100              0 65002 i +*> 10.102.1.0/24    172.16.1.2             100              0 65002 i +*> 10.102.2.0/24    172.16.1.2             100              0 65002 i +*> 10.102.3.0/24    172.16.1.2             100              0 65002 i +*> 10.102.4.0/24    172.16.1.2             100              0 65002 i +*> 10.102.5.0/24    172.16.1.2             100              0 65002 i +*> 10.102.6.0/24    172.16.1.2             100              0 65002 i +*> 10.102.7.0/24    172.16.1.2             100              0 65002 i +*> 10.102.8.0/24    172.16.1.2             100              0 65002 i +*> 10.102.9.0/24    172.16.1.2             100              0 65002 i +*> 10.105.0.0/24    172.16.1.5             100              0 65005 i +*> 10.105.1.0/24    172.16.1.5             100              0 65005 i +*> 10.105.2.0/24    172.16.1.5             100              0 65005 i +*> 10.105.3.0/24    172.16.1.5             100              0 65005 i +*> 10.105.4.0/24    172.16.1.5             100              0 65005 i +*> 10.105.5.0/24    172.16.1.5             100              0 65005 i +*> 10.105.6.0/24    172.16.1.5             100              0 65005 i +*> 10.105.7.0/24    172.16.1.5             100              0 65005 i +*> 10.105.8.0/24    172.16.1.5             100              0 65005 i +*> 10.105.9.0/24    172.16.1.5             100              0 65005 i  *> 172.20.0.0/28    0.0.0.0                  0          32768 i
E   AssertionError: Routing Table verification failed for router r1, view 1:
    No template matched.
    template /root/bamboo-agent-home/xml-data/build-dir/FRR-FRRPULLREQ-TP2U1804AMD64/topotests/bgp_multiview_topo1/r1/show_ip_bgp_view_1-post4.1.ref: r1 failed Routing Table Check for view 1:
    --- actual BGP routing table
    +++ expected BGP routing table
    @@ -1,9 +1,41 @@
     BGP table version is XXX, local router ID is 172.30.1.1, vrf id -
(132 more lines...)
Collapse Failed test_bgp_multiview_topo1 test_bgp_converge History
Topo Tests Part 2 on Ubuntu 16.04 amd64 2 mins
AssertionError: BGP did not converge:      IPv4 Unicast Summary:   BGP router identifier 172.30.1.1, local AS number 100 vrf-id -1   BGP table version 1   RIB entries 1, using 192 bytes of memory   Peers 3, using 64 KiB of memory      Neighbor        V         AS   MsgRcvd   MsgSent   TblVer  InQ OutQ  Up/Down State/PfxRcd   PfxSnt   172.16.1.1      4      65001        56        45        0    0    0 00:02:08     (Policy) (Policy)   172.16.1.2      4      65002        56        45        0    0    0 00:02:08     (Policy) (Policy)   172.16.1.5      4      65005        56        45        0    0    0 00:02:08     (Policy) (Policy)      Total number of neighbors 3    assert False
E   AssertionError: BGP did not converge:
      
      IPv4 Unicast Summary:
      BGP router identifier 172.30.1.1, local AS number 100 vrf-id -1
      BGP table version 1
      RIB entries 1, using 192 bytes of memory
      Peers 3, using 64 KiB of memory
(9 more lines...)
Collapse Failed test_bgp_multiview_topo1 test_bgp_routingTable History
Topo Tests Part 2 on Ubuntu 16.04 amd64 < 1 sec
AssertionError: Routing Table verification failed for router r1, view 1: No template matched. template /root/bamboo-agent-home/xml-data/build-dir/FRR-FRRPULLREQ-TP0U1604AMD64/topotests/bgp_multiview_topo1/r1/show_ip_bgp_view_1-post6.1.ref: r1 failed Routing Table Check for view 1: --- actual BGP routing table +++ expected BGP routing table @@ -6,4 +6,37 @@  Origin codes:  i - IGP, e - EGP, ? - incomplete       Network          Next Hop            Metric LocPrf Weight Path +*  10.0.1.0/24      172.16.1.5                             0 65005 i +*                   172.16.1.2                             0 65002 i +*>                  172.16.1.1                             0 65001 i +*> 10.101.0.0/24    172.16.1.1             100              0 65001 i +*> 10.101.1.0/24    172.16.1.1             100              0 65001 i +*> 10.101.2.0/24    172.16.1.1             100              0 65001 i +*> 10.101.3.0/24    172.16.1.1             100              0 65001 i +*> 10.101.4.0/24    172.16.1.1             100              0 65001 i +*> 10.101.5.0/24    172.16.1.1             100              0 65001 i +*> 10.101.6.0/24    172.16.1.1             100              0 65001 i +*> 10.101.7.0/24    172.16.1.1             100              0 65001 i +*> 10.101.8.0/24    172.16.1.1             100              0 65001 i +*> 10.101.9.0/24    172.16.1.1             100              0 65001 i +*> 10.102.0.0/24    172.16.1.2             100              0 65002 i +*> 10.102.1.0/24    172.16.1.2             100              0 65002 i +*> 10.102.2.0/24    172.16.1.2             100              0 65002 i +*> 10.102.3.0/24    172.16.1.2             100              0 65002 i +*> 10.102.4.0/24    172.16.1.2             100              0 65002 i +*> 10.102.5.0/24    172.16.1.2             100              0 65002 i +*> 10.102.6.0/24    172.16.1.2             100              0 65002 i +*> 10.102.7.0/24    172.16.1.2             100              0 65002 i +*> 10.102.8.0/24    172.16.1.2             100              0 65002 i +*> 10.102.9.0/24    172.16.1.2             100              0 65002 i +*> 10.105.0.0/24    172.16.1.5             100              0 65005 i +*> 10.105.1.0/24    172.16.1.5             100              0 65005 i +*> 10.105.2.0/24    172.16.1.5             100              0 65005 i +*> 10.105.3.0/24    172.16.1.5             100              0 65005 i +*> 10.105.4.0/24    172.16.1.5             100              0 65005 i +*> 10.105.5.0/24    172.16.1.5             100              0 65005 i +*> 10.105.6.0/24    172.16.1.5             100              0 65005 i +*> 10.105.7.0/24    172.16.1.5             100              0 65005 i +*> 10.105.8.0/24    172.16.1.5             100              0 65005 i +*> 10.105.9.0/24    172.16.1.5             100              0 65005 i  *> 172.20.0.0/28    0.0.0.0                  0          32768 i template /root/bamboo-agent-home/xml-data/build-dir/FRR-FRRPULLREQ-TP0U1604AMD64/topotests/bgp_multiview_topo1/r1/show_ip_bgp_view_1.ref: r1 failed Routing Table Check for view 1: --- actual BGP routing table +++ expected BGP routing table @@ -1,9 +1,40 @@ -BGP table version is XXX, local router ID is 172.30.1.1, vrf id - -Default local pref 100, local AS 100 -Status codes:  s suppressed, d damped, h history, * valid, > best, = multipath, -               i internal, r RIB-failure, S Stale, R Removed -Nexthop codes: @NNN nexthop's vrf id, < announce-nh-self -Origin codes:  i - IGP, e - EGP, ? - incomplete +BGP table version is XXX, local router ID is 172.30.1.1 +Status codes: s suppressed, d damped, h history, * valid, > best, = multipath, +              i internal, r RIB-failure, S Stale, R Removed +Origin codes: i - IGP, e - EGP, ? - incomplete       Network          Next Hop            Metric LocPrf Weight Path +*  10.0.1.0/24      172.16.1.5                             0 65005 i +*                   172.16.1.2                             0 65002 i +*>                  172.16.1.1                             0 65001 i +*> 10.101.0.0/24    172.16.1.1             100              0 65001 i +*> 10.101.1.0/24    172.16.1.1             100              0 65001 i +*> 10.101.2.0/24    172.16.1.1             100              0 65001 i +*> 10.101.3.0/24    172.16.1.1             100              0 65001 i +*> 10.101.4.0/24    172.16.1.1             100              0 65001 i +*> 10.101.5.0/24    172.16.1.1             100              0 65001 i +*> 10.101.6.0/24    172.16.1.1             100              0 65001 i +*> 10.101.7.0/24    172.16.1.1             100              0 65001 i +*> 10.101.8.0/24    172.16.1.1             100              0 65001 i +*> 10.101.9.0/24    172.16.1.1             100              0 65001 i +*> 10.102.0.0/24    172.16.1.2             100              0 65002 i +*> 10.102.1.0/24    172.16.1.2             100              0 65002 i +*> 10.102.2.0/24    172.16.1.2             100              0 65002 i +*> 10.102.3.0/24    172.16.1.2             100              0 65002 i +*> 10.102.4.0/24    172.16.1.2             100              0 65002 i +*> 10.102.5.0/24    172.16.1.2             100              0 65002 i +*> 10.102.6.0/24    172.16.1.2             100              0 65002 i +*> 10.102.7.0/24    172.16.1.2             100              0 65002 i +*> 10.102.8.0/24    172.16.1.2             100              0 65002 i +*> 10.102.9.0/24    172.16.1.2             100              0 65002 i +*> 10.105.0.0/24    172.16.1.5             100              0 65005 i +*> 10.105.1.0/24    172.16.1.5             100              0 65005 i +*> 10.105.2.0/24    172.16.1.5             100              0 65005 i +*> 10.105.3.0/24    172.16.1.5             100              0 65005 i +*> 10.105.4.0/24    172.16.1.5             100              0 65005 i +*> 10.105.5.0/24    172.16.1.5             100              0 65005 i +*> 10.105.6.0/24    172.16.1.5             100              0 65005 i +*> 10.105.7.0/24    172.16.1.5             100              0 65005 i +*> 10.105.8.0/24    172.16.1.5             100              0 65005 i +*> 10.105.9.0/24    172.16.1.5             100              0 65005 i  *> 172.20.0.0/28    0.0.0.0                  0          32768 i template /root/bamboo-agent-home/xml-data/build-dir/FRR-FRRPULLREQ-TP0U1604AMD64/topotests/bgp_multiview_topo1/r1/show_ip_bgp_view_1-post4.1.ref: r1 failed Routing Table Check for view 1: --- actual BGP routing table +++ expected BGP routing table @@ -1,9 +1,41 @@  BGP table version is XXX, local router ID is 172.30.1.1, vrf id - -Default local pref 100, local AS 100  Status codes:  s suppressed, d damped, h history, * valid, > best, = multipath,                 i internal, r RIB-failure, S Stale, R Removed  Nexthop codes: @NNN nexthop's vrf id, < announce-nh-self  Origin codes:  i - IGP, e - EGP, ? - incomplete       Network          Next Hop            Metric LocPrf Weight Path +*  10.0.1.0/24      172.16.1.5                             0 65005 i +*                   172.16.1.2                             0 65002 i +*>                  172.16.1.1                             0 65001 i +*> 10.101.0.0/24    172.16.1.1             100              0 65001 i +*> 10.101.1.0/24    172.16.1.1             100              0 65001 i +*> 10.101.2.0/24    172.16.1.1             100              0 65001 i +*> 10.101.3.0/24    172.16.1.1             100              0 65001 i +*> 10.101.4.0/24    172.16.1.1             100              0 65001 i +*> 10.101.5.0/24    172.16.1.1             100              0 65001 i +*> 10.101.6.0/24    172.16.1.1             100              0 65001 i +*> 10.101.7.0/24    172.16.1.1             100              0 65001 i +*> 10.101.8.0/24    172.16.1.1             100              0 65001 i +*> 10.101.9.0/24    172.16.1.1             100              0 65001 i +*> 10.102.0.0/24    172.16.1.2             100              0 65002 i +*> 10.102.1.0/24    172.16.1.2             100              0 65002 i +*> 10.102.2.0/24    172.16.1.2             100              0 65002 i +*> 10.102.3.0/24    172.16.1.2             100              0 65002 i +*> 10.102.4.0/24    172.16.1.2             100              0 65002 i +*> 10.102.5.0/24    172.16.1.2             100              0 65002 i +*> 10.102.6.0/24    172.16.1.2             100              0 65002 i +*> 10.102.7.0/24    172.16.1.2             100              0 65002 i +*> 10.102.8.0/24    172.16.1.2             100              0 65002 i +*> 10.102.9.0/24    172.16.1.2             100              0 65002 i +*> 10.105.0.0/24    172.16.1.5             100              0 65005 i +*> 10.105.1.0/24    172.16.1.5             100              0 65005 i +*> 10.105.2.0/24    172.16.1.5             100              0 65005 i +*> 10.105.3.0/24    172.16.1.5             100              0 65005 i +*> 10.105.4.0/24    172.16.1.5             100              0 65005 i +*> 10.105.5.0/24    172.16.1.5             100              0 65005 i +*> 10.105.6.0/24    172.16.1.5             100              0 65005 i +*> 10.105.7.0/24    172.16.1.5             100              0 65005 i +*> 10.105.8.0/24    172.16.1.5             100              0 65005 i +*> 10.105.9.0/24    172.16.1.5             100              0 65005 i  *> 172.20.0.0/28    0.0.0.0                  0          32768 i
E   AssertionError: Routing Table verification failed for router r1, view 1:
    No template matched.
    template /root/bamboo-agent-home/xml-data/build-dir/FRR-FRRPULLREQ-TP0U1604AMD64/topotests/bgp_multiview_topo1/r1/show_ip_bgp_view_1-post6.1.ref: r1 failed Routing Table Check for view 1:
    --- actual BGP routing table
    +++ expected BGP routing table
    @@ -6,4 +6,37 @@
     Origin codes:  i - IGP, e - EGP, ? - incomplete
(132 more lines...)

Jira issues

IssueDescriptionStatus
Unknown Issue TypeFRR-7Could not obtain issue details from Jira