FreeRangeRouting Github Pull Request Testing

Build: #17266 failed Custom build by Github Hook with revision master

Stages & jobs

  1. Get Sourcecode

  2. Building Stage

  3. Basic Tests

  4. Final

    Final

Build result summary

Details

Completed
Duration
146 minutes
Flags
Custom revisionCustom build
Labels
version=frr-7_4-dev-4212-gf8b44e73fgit=https_//github_com/frrouting/frr_gitbuildurl=https_//ci1_netdef_org/browse/frr-frrpullreq-17266branch=master
Revision
4fe016fe133d704c733e5e1e333075fffeec34de 4fe016fe133d704c733e5e1e333075fffeec34de
Total tests
11103
Fixed in
#17267 (Custom build by Github Hook with revision master)

Tests

Custom variables

Custom revision
4fe016fe133d704c733e5e1e333075fffeec34de 4fe016fe133d704c733e5e1e333075fffeec34de
Name Value
github_base_sha 4fe016fe133d704c733e5e1e333075fffeec34de
github_pullreq 7859
github_repo FRRouting/frr
github_merge_sha f8b44e73f987d4ece4e65cdd8fb136809be7b7fc
github_branch master

Comments

  1. Github Hook

    GitHub Merge Request 7859
    for GitHub Repo FRRouting/frr, branch master

    Request to merge from KaushikNiral/frr
    Merge Git Commit ID f8b44e73f987d4ece4e65cdd8fb136809be7b7fc on top of base Git Commit ID 4fe016fe133d704c733e5e1e333075fffeec34de

Code commits

Author Commit Message Commit date
Donatas Abraitis <donatas.abraitis@gmail.com> Donatas Abraitis <donatas.abraitis@gmail.com> 4fe016fe133d704c733e5e1e333075fffeec34de 4fe016fe133d704c733e5e1e333075fffeec34de Merge pull request #7435 from sudhanshukumar22/bgp-peer-group-issue
Bgp peer group issue

Tests

New test failures 5
Status Test View job Duration
Collapse Failed test_bgp_listen_on_multiple_addresses test_peering History
TopoTests Ubuntu 16.04 i386 Part 4 6 secs
AssertionError: r2: Daemon bgpd not running
E   AssertionError: r2: Daemon bgpd not running
Collapse Failed test_ospf_topo1 test_ospf6_convergence History
TopoTests Ubuntu 18.04 arm8 Part 9 1 min
AssertionError: OSPF6 did not converge on r1:   --- Current output   +++ Expected output   @@ -1,12 +1,12 @@   - N IA 2001:db8:1::/64 :: r1-eth0   - N IA 2001:db8:2::/64 fe80::xxxx:xxxx:xxxx:xxxx r1-eth1   +*N IA 2001:db8:1::/64 :: r1-eth0   +*N IA 2001:db8:2::/64 fe80::xxxx:xxxx:xxxx:xxxx r1-eth1     N E1 2001:db8:2::/64 fe80::xxxx:xxxx:xxxx:xxxx r1-eth1   - N IA 2001:db8:3::/64 :: r1-eth1   +*N IA 2001:db8:3::/64 :: r1-eth1     N E1 2001:db8:3::/64 fe80::xxxx:xxxx:xxxx:xxxx r1-eth1     fe80::xxxx:xxxx:xxxx:xxxx r1-eth1   - N IA 2001:db8:100::/64 fe80::xxxx:xxxx:xxxx:xxxx r1-eth1   +*N IA 2001:db8:100::/64 fe80::xxxx:xxxx:xxxx:xxxx r1-eth1     N E1 2001:db8:100::/64 fe80::xxxx:xxxx:xxxx:xxxx r1-eth1   - N IE 2001:db8:200::/64 fe80::xxxx:xxxx:xxxx:xxxx r1-eth1   +*N IE 2001:db8:200::/64 fe80::xxxx:xxxx:xxxx:xxxx r1-eth1     N E1 2001:db8:200::/64 fe80::xxxx:xxxx:xxxx:xxxx r1-eth1     N E1 2001:db8:200::/64 fe80::xxxx:xxxx:xxxx:xxxx r1-eth1    *N IE 2001:db8:300::/64 fe80::xxxx:xxxx:xxxx:xxxx r1-eth1 assert False
E   AssertionError: OSPF6 did not converge on r1:
      --- Current output
      +++ Expected output
      @@ -1,12 +1,12 @@
      - N IA 2001:db8:1::/64 :: r1-eth0
      - N IA 2001:db8:2::/64 fe80::xxxx:xxxx:xxxx:xxxx r1-eth1
      +*N IA 2001:db8:1::/64 :: r1-eth0
(15 more lines...)
Collapse Failed test_ospf_topo1 test_ospf6_convergence History
TopoTests Ubuntu 16.04 i386 Part 9 1 min
AssertionError: OSPF6 did not converge on r1:   --- Current output   +++ Expected output   @@ -1,12 +1,12 @@   - N IA 2001:db8:1::/64 :: r1-eth0   - N IA 2001:db8:2::/64 fe80::xxxx:xxxx:xxxx:xxxx r1-eth1   +*N IA 2001:db8:1::/64 :: r1-eth0   +*N IA 2001:db8:2::/64 fe80::xxxx:xxxx:xxxx:xxxx r1-eth1     N E1 2001:db8:2::/64 fe80::xxxx:xxxx:xxxx:xxxx r1-eth1   - N IA 2001:db8:3::/64 :: r1-eth1   +*N IA 2001:db8:3::/64 :: r1-eth1     N E1 2001:db8:3::/64 fe80::xxxx:xxxx:xxxx:xxxx r1-eth1     fe80::xxxx:xxxx:xxxx:xxxx r1-eth1   - N IA 2001:db8:100::/64 fe80::xxxx:xxxx:xxxx:xxxx r1-eth1   +*N IA 2001:db8:100::/64 fe80::xxxx:xxxx:xxxx:xxxx r1-eth1     N E1 2001:db8:100::/64 fe80::xxxx:xxxx:xxxx:xxxx r1-eth1   - N IE 2001:db8:200::/64 fe80::xxxx:xxxx:xxxx:xxxx r1-eth1   +*N IE 2001:db8:200::/64 fe80::xxxx:xxxx:xxxx:xxxx r1-eth1     N E1 2001:db8:200::/64 fe80::xxxx:xxxx:xxxx:xxxx r1-eth1     N E1 2001:db8:200::/64 fe80::xxxx:xxxx:xxxx:xxxx r1-eth1    *N IE 2001:db8:300::/64 fe80::xxxx:xxxx:xxxx:xxxx r1-eth1 assert False
E   AssertionError: OSPF6 did not converge on r1:
      --- Current output
      +++ Expected output
      @@ -1,12 +1,12 @@
      - N IA 2001:db8:1::/64 :: r1-eth0
      - N IA 2001:db8:2::/64 fe80::xxxx:xxxx:xxxx:xxxx r1-eth1
      +*N IA 2001:db8:1::/64 :: r1-eth0
(15 more lines...)
Collapse Failed test_ospf_topo1 test_ospf6_convergence History
TopoTests Ubuntu 16.04 amd64 Part 9 1 min
AssertionError: OSPF6 did not converge on r1:   --- Current output   +++ Expected output   @@ -1,12 +1,12 @@   - N IA 2001:db8:1::/64 :: r1-eth0   - N IA 2001:db8:2::/64 fe80::xxxx:xxxx:xxxx:xxxx r1-eth1   +*N IA 2001:db8:1::/64 :: r1-eth0   +*N IA 2001:db8:2::/64 fe80::xxxx:xxxx:xxxx:xxxx r1-eth1     N E1 2001:db8:2::/64 fe80::xxxx:xxxx:xxxx:xxxx r1-eth1   - N IA 2001:db8:3::/64 :: r1-eth1   +*N IA 2001:db8:3::/64 :: r1-eth1     N E1 2001:db8:3::/64 fe80::xxxx:xxxx:xxxx:xxxx r1-eth1     fe80::xxxx:xxxx:xxxx:xxxx r1-eth1   - N IA 2001:db8:100::/64 fe80::xxxx:xxxx:xxxx:xxxx r1-eth1   +*N IA 2001:db8:100::/64 fe80::xxxx:xxxx:xxxx:xxxx r1-eth1     N E1 2001:db8:100::/64 fe80::xxxx:xxxx:xxxx:xxxx r1-eth1   - N IE 2001:db8:200::/64 fe80::xxxx:xxxx:xxxx:xxxx r1-eth1   +*N IE 2001:db8:200::/64 fe80::xxxx:xxxx:xxxx:xxxx r1-eth1     N E1 2001:db8:200::/64 fe80::xxxx:xxxx:xxxx:xxxx r1-eth1     N E1 2001:db8:200::/64 fe80::xxxx:xxxx:xxxx:xxxx r1-eth1    *N IE 2001:db8:300::/64 fe80::xxxx:xxxx:xxxx:xxxx r1-eth1 assert False
E   AssertionError: OSPF6 did not converge on r1:
      --- Current output
      +++ Expected output
      @@ -1,12 +1,12 @@
      - N IA 2001:db8:1::/64 :: r1-eth0
      - N IA 2001:db8:2::/64 fe80::xxxx:xxxx:xxxx:xxxx r1-eth1
      +*N IA 2001:db8:1::/64 :: r1-eth0
(15 more lines...)
Collapse Failed test_ospf_topo1 test_ospf6_convergence History
TopoTests Ubuntu 18.04 amd64 Part 9 1 min
AssertionError: OSPF6 did not converge on r1:   --- Current output   +++ Expected output   @@ -1,12 +1,12 @@   - N IA 2001:db8:1::/64 :: r1-eth0   - N IA 2001:db8:2::/64 fe80::xxxx:xxxx:xxxx:xxxx r1-eth1   +*N IA 2001:db8:1::/64 :: r1-eth0   +*N IA 2001:db8:2::/64 fe80::xxxx:xxxx:xxxx:xxxx r1-eth1     N E1 2001:db8:2::/64 fe80::xxxx:xxxx:xxxx:xxxx r1-eth1   - N IA 2001:db8:3::/64 :: r1-eth1   +*N IA 2001:db8:3::/64 :: r1-eth1     N E1 2001:db8:3::/64 fe80::xxxx:xxxx:xxxx:xxxx r1-eth1     fe80::xxxx:xxxx:xxxx:xxxx r1-eth1   - N IA 2001:db8:100::/64 fe80::xxxx:xxxx:xxxx:xxxx r1-eth1   +*N IA 2001:db8:100::/64 fe80::xxxx:xxxx:xxxx:xxxx r1-eth1     N E1 2001:db8:100::/64 fe80::xxxx:xxxx:xxxx:xxxx r1-eth1   - N IE 2001:db8:200::/64 fe80::xxxx:xxxx:xxxx:xxxx r1-eth1   +*N IE 2001:db8:200::/64 fe80::xxxx:xxxx:xxxx:xxxx r1-eth1     N E1 2001:db8:200::/64 fe80::xxxx:xxxx:xxxx:xxxx r1-eth1     N E1 2001:db8:200::/64 fe80::xxxx:xxxx:xxxx:xxxx r1-eth1    *N IE 2001:db8:300::/64 fe80::xxxx:xxxx:xxxx:xxxx r1-eth1 assert False
E   AssertionError: OSPF6 did not converge on r1:
      --- Current output
      +++ Expected output
      @@ -1,12 +1,12 @@
      - N IA 2001:db8:1::/64 :: r1-eth0
      - N IA 2001:db8:2::/64 fe80::xxxx:xxxx:xxxx:xxxx r1-eth1
      +*N IA 2001:db8:1::/64 :: r1-eth0
(15 more lines...)