FreeRangeRouting Github Pull Request Testing

Build: #18250 failed Custom build by Github Hook with revision master

Stages & jobs

  1. Get Sourcecode

  2. Building Stage

  3. Basic Tests

  4. Final

    Final

Build result summary

Details

Completed
Duration
221 minutes
Flags
Custom revisionCustom build
Labels
version=frr-7_4-dev-5333-g46d3c1859git=https_//github_com/frrouting/frr_gitbuildurl=https_//ci1_netdef_org/browse/frr-frrpullreq-18250branch=master
Revision
a702694a60dd7fd25433878a1fe10e6b12490537 a702694a60dd7fd25433878a1fe10e6b12490537
Total tests
11765
Fixed in
#18253 (Custom build by Github Hook with revision master)

Tests

Custom variables

Custom revision
a702694a60dd7fd25433878a1fe10e6b12490537 a702694a60dd7fd25433878a1fe10e6b12490537
Name Value
github_base_sha a702694a60dd7fd25433878a1fe10e6b12490537
github_pullreq 8153
github_repo FRRouting/frr
github_merge_sha 46d3c1859ba622547529cd917c3853c71ee919fe
github_branch master

Comments

  1. Github Hook

    GitHub Merge Request 8153
    for GitHub Repo FRRouting/frr, branch master

    Request to merge from reubendowle/frr
    Merge Git Commit ID 46d3c1859ba622547529cd917c3853c71ee919fe on top of base Git Commit ID a702694a60dd7fd25433878a1fe10e6b12490537

Code commits

Author Commit Message Commit date
Mark Stapp <mjs@voltanet.io> Mark Stapp <mjs@voltanet.io> a702694a60dd7fd25433878a1fe10e6b12490537 a702694a60dd7fd25433878a1fe10e6b12490537 Merge pull request #8365 from aldobrrrr/fix_parse_topology_function_in_isis_topo1_vrf_test
topotests: fix 'parse_topology' function in test_isis_topo1_vrf.py

Tests

New test failures 2
Status Test View job Duration
Collapse Failed test_bgp_gr_functionality_topo2 test_BGP_GR_21_p2 History
TopoTests Ubuntu 18.04 arm8 Part 4 2 mins
AssertionError: Testcase test_BGP_GR_21_p2 :Failed     Error [DUT: r1]: localGrMode is not correct Expected: Helper, Found: Helper* assert '[DUT: r1]: localGrMode is not correct Expected: Helper, Found: Helper*' is True
E   AssertionError: Testcase test_BGP_GR_21_p2 :Failed 
       Error [DUT: r1]: localGrMode is not correct Expected: Helper, Found: Helper*
    assert '[DUT: r1]: localGrMode is not correct Expected: Helper, Found: Helper*' is True
Collapse Failed test_bgp_l3vpn_to_bgp_vrf test_adjacencies History
TopoTests Ubuntu 18.04 arm8 Part 4 20 secs
AssertionError: 1 tests failed
E   AssertionError: 1 tests failed