FreeRangeRouting Github Pull Request Testing

Build: #18260 failed Custom build by Github Hook with revision master

Stages & jobs

  1. Get Sourcecode

  2. Building Stage

  3. Basic Tests

  4. Final

    Final

Build result summary

Details

Completed
Duration
223 minutes
Flags
Custom revisionCustom build
Labels
version=frr-7_4-dev-5349-ge2fe02ff6git=https_//github_com/frrouting/frr_gitbuildurl=https_//ci1_netdef_org/browse/frr-frrpullreq-18260branch=master
Revision
fb94a2e65dbf740b4bbd1d5eec00fb3b2e7d62c5 fb94a2e65dbf740b4bbd1d5eec00fb3b2e7d62c5
Total tests
11765
Failing since
#18259 (Custom build by Github Hook with revision master)
Fixed in
#18261 (Custom build by Github Hook with revision master)

Tests

Custom variables

Custom revision
fb94a2e65dbf740b4bbd1d5eec00fb3b2e7d62c5 fb94a2e65dbf740b4bbd1d5eec00fb3b2e7d62c5
Name Value
github_base_sha fb94a2e65dbf740b4bbd1d5eec00fb3b2e7d62c5
github_pullreq 8429
github_repo FRRouting/frr
github_merge_sha e2fe02ff6ff96151cbf90edabb6ac38b651fe9f4
github_branch master

Comments

  1. Github Hook

    GitHub Merge Request 8429
    for GitHub Repo FRRouting/frr, branch master

    Request to merge from donaldsharp/frr
    Merge Git Commit ID e2fe02ff6ff96151cbf90edabb6ac38b651fe9f4 on top of base Git Commit ID fb94a2e65dbf740b4bbd1d5eec00fb3b2e7d62c5

Code commits

Author Commit Message Commit date
Patrick Ruddy <pat@voltanet.io> Patrick Ruddy <pat@voltanet.io> fb94a2e65dbf740b4bbd1d5eec00fb3b2e7d62c5 fb94a2e65dbf740b4bbd1d5eec00fb3b2e7d62c5 Merge pull request #8402 from opensourcerouting/debian10-topotest-fix
tests: fix for l3mdev topotests on kernel 4.19

Tests

New test failures 2
Status Test View job Duration
Collapse Failed test_bgp_vrf_ipv6_ll_func test_bgp_vrf_link_local History
TopoTests Ubuntu 18.04 arm8 Part 6 1 min
AssertionError: Failed bgp convergence in "TopoGear<name="r1",links=["r1-eth0"<->"s1-eth0","r1-eth1"<->"s2-eth0"]> TopoRouter<>" assert Generated JSON diff error report:      > $->fe80:1::2->bgpState: d1 has element with value 'Active' but in d2 it has value 'Established'
E   AssertionError: Failed bgp convergence in "TopoGear<name="r1",links=["r1-eth0"<->"s1-eth0","r1-eth1"<->"s2-eth0"]> TopoRouter<>"
    assert Generated JSON diff error report:
      
      > $->fe80:1::2->bgpState: d1 has element with value 'Active' but in d2 it has value 'Established'
Collapse Failed test_bgp_vrf_ipv6_ll_func test_bgp_vrf_link_local History
TopoTests Ubuntu 18.04 amd64 Part 6 47 secs
AssertionError: Failed bgp convergence in "TopoGear<name="r1",links=["r1-eth0"<->"s1-eth0","r1-eth1"<->"s2-eth0"]> TopoRouter<>" assert Generated JSON diff error report:      > $->fe80:1::2->bgpState: d1 has element with value 'Active' but in d2 it has value 'Established'
E   AssertionError: Failed bgp convergence in "TopoGear<name="r1",links=["r1-eth0"<->"s1-eth0","r1-eth1"<->"s2-eth0"]> TopoRouter<>"
    assert Generated JSON diff error report:
      
      > $->fe80:1::2->bgpState: d1 has element with value 'Active' but in d2 it has value 'Established'