FreeRangeRouting Github Pull Request Testing

Build: #18799 failed Custom build by Github Hook with revision master

Stages & jobs

  1. Get Sourcecode

  2. Building Stage

  3. Basic Tests

  4. Final

    Final

Build result summary

Details

Completed
Duration
199 minutes
Flags
Custom revisionCustom build
Labels
version=frr-7_4-dev-5685-ga9f42ac2egit=https_//github_com/frrouting/frr_gitbuildurl=https_//ci1_netdef_org/browse/frr-frrpullreq-18799branch=master
Revision
8ad44ef497151050bb02e2f61070bc4417559aa1 8ad44ef497151050bb02e2f61070bc4417559aa1
Total tests
12361
Fixed in
#18800 (Custom build by Github Hook with revision master)

Tests

Custom variables

Custom revision
8ad44ef497151050bb02e2f61070bc4417559aa1 8ad44ef497151050bb02e2f61070bc4417559aa1
Name Value
github_base_sha 8ad44ef497151050bb02e2f61070bc4417559aa1
github_pullreq 8618
github_repo FRRouting/frr
github_merge_sha a9f42ac2e349694cb5384f80c8a0981b62e018c7
github_branch master

Comments

  1. Github Hook

    GitHub Merge Request 8618
    for GitHub Repo FRRouting/frr, branch master

    Request to merge from Prerana-GB/frr
    Merge Git Commit ID a9f42ac2e349694cb5384f80c8a0981b62e018c7 on top of base Git Commit ID 8ad44ef497151050bb02e2f61070bc4417559aa1

Code commits

Author Commit Message Commit date
Russ White <russ@riw.us> Russ White <russ@riw.us> 8ad44ef497151050bb02e2f61070bc4417559aa1 8ad44ef497151050bb02e2f61070bc4417559aa1 Merge pull request #8514 from donaldsharp/connected_is_limited
zebra: Allow one connected route per network mask on a interface

Tests

New test failures 2
Status Test View job Duration
Collapse Failed test_bfd_topo3 test_wait_bfd_convergence History
TopoTests Ubuntu 18.04 amd64 Part 1 2 mins
AssertionError: "r1" BFD configuration failure assert Generated JSON diff error report:      > $: d2 has the following element at index 1 which is not present in d1:        {        "echo-transmit-interval": 0,        "status": "up",        "detect-multiplier": 3,        "remote-receive-interval": 600,        "receive-interval": 600,        "remote-diagnostic": "ok",        "uptime": "*",        "diagnostic": "ok",        "multihop": false,        "interface": "r1-eth0",        "remote-echo-receive-interval": 50,        "transmit-interval": 600,        "passive-mode": true,        "remote-transmit-interval": 600,        "peer": "2001:db8:1::2",        "echo-receive-interval": 50,        "remote-id": "*",        "local": "2001:db8:1::1",        "id": "*",        "remote-detect-multiplier": 3,        "vrf": "default"    }       Closest match in d1 is at index 1 with the following errors:        > $[1]: d2 has key 'uptime' which is not present in d1    > $[1]->status: d1 has element with value 'init' but in d2 it has value 'up'    > $[1]->remote-receive-interval: d1 has element with value '1000' but in d2 it has value '600'    > $[1]->remote-transmit-interval: d1 has element with value '1000' but in d2 it has value '600'
E   AssertionError: "r1" BFD configuration failure
    assert Generated JSON diff error report:
      
      > $: d2 has the following element at index 1 which is not present in d1: 
      
      	{
      	    "echo-transmit-interval": 0,
(28 more lines...)
Collapse Failed test_ospf_sr_topo1 test_rib_ipv4_step4 History
TopoTests Debian 10 amd64 Part 9 1 min
AssertionError: "rt6" JSON output mismatches the expected result assert Generated JSON diff error report:      > $->10.0.8.0/24: d2 has the following element at index 0 which is not present in d1:        {        "distance": 110,        "prefix": "10.0.8.0/24",        "protocol": "ospf",        "metric": 10,        "nexthops": [            {                "active": true,                "directlyConnected": true,                "interfaceName": "eth-rt5"            }        ]    }       Closest match in d1 is at index 0 with the following errors:        > $->10.0.8.0/24[0]->nexthops: d2 has the following element at index 0 which is not present in d1:          {         "active": true,         "directlyConnected": true,         "interfaceName": "eth-rt5"     }         Closest match in d1 is at index 0 with the following errors:          > $->10.0.8.0/24[0]->nexthops[0]: d2 has key 'active' which is not present in d1
E   AssertionError: "rt6" JSON output mismatches the expected result
    assert Generated JSON diff error report:
      
      > $->10.0.8.0/24: d2 has the following element at index 0 which is not present in d1: 
      
      	{
      	    "distance": 110,
(25 more lines...)