FreeRangeRouting Github Pull Request Testing

Build: #19575 failed Custom build by Github Hook with revision master

Stages & jobs

  1. Get Sourcecode

  2. Building Stage

  3. Basic Tests

  4. Final

    Final

Build result summary

Details

Completed
Duration
127 minutes
Flags
Custom revisionCustom build
Labels
version=8_1-dev-327-ge7a8aeb58git=https_//github_com/frrouting/frr_gitbuildurl=https_//ci1_netdef_org/browse/frr-frrpullreq-19575branch=master
Revision
352cc841d897eb343f12d7f85c7f346ab3c29beb 352cc841d897eb343f12d7f85c7f346ab3c29beb
Total tests
12589
Failing since
#19574 (Custom build by Github Hook with revision master)
Fixed in
#19595 (Custom build by Github Hook with revision master)

Tests

Custom variables

Custom revision
352cc841d897eb343f12d7f85c7f346ab3c29beb 352cc841d897eb343f12d7f85c7f346ab3c29beb
Name Value
github_base_sha 352cc841d897eb343f12d7f85c7f346ab3c29beb
github_pullreq 8847
github_repo FRRouting/frr
github_merge_sha e7a8aeb5894bbdca37d33d8e633406e22713e382
github_branch master

Comments

  1. Github Hook

    GitHub Merge Request 8847
    for GitHub Repo FRRouting/frr, branch master

    Request to merge from anlancs/frr
    Merge Git Commit ID e7a8aeb5894bbdca37d33d8e633406e22713e382 on top of base Git Commit ID 352cc841d897eb343f12d7f85c7f346ab3c29beb

Code commits

Author Commit Message Commit date
Igor Ryzhov <iryzhov@nfware.com> Igor Ryzhov <iryzhov@nfware.com> 352cc841d897eb343f12d7f85c7f346ab3c29beb 352cc841d897eb343f12d7f85c7f346ab3c29beb Merge pull request #8831 from sworleys/Fix-No-Ospf-Func
ospf6d: fix undefined function

Tests

New test failures 1909
Status Test View job Duration
Collapse Failed test_all_protocol_startup test_nht History
TopoTests Ubuntu 18.04 arm8 Part 1 < 1 sec
AssertionError: r1 failed ip nht check:   --- Actual `show ip nht`   +++ Expected `show ip nht`   @@ -1 +1,72 @@   -   +1.1.1.1   + resolved via static   + is directly connected, r1-eth1   + Client list: pbr(fd XX)   +1.1.1.2   + resolved via static   + is directly connected, r1-eth2   + Client list: pbr(fd XX)   +1.1.1.3   + resolved via static   + is directly connected, r1-eth3   + Client list: pbr(fd XX)   +1.1.1.4   + resolved via static   + is directly connected, r1-eth4   + Client list: pbr(fd XX)   +1.1.1.5   + resolved via static   + is directly connected, r1-eth5   + Client list: pbr(fd XX)   +1.1.1.6   + resolved via static   + is directly connected, r1-eth6   + Client list: pbr(fd XX)   +1.1.1.7   + resolved via static   + is directly connected, r1-eth7   + Client list: pbr(fd XX)   +1.1.1.8   + resolved via static   + is directly connected, r1-eth8   + Client list: pbr(fd XX)   +2.2.2.1   + unresolved   + Client list: pbr(fd XX)   +4.4.4.1   + unresolved   + Client list: pbr(fd XX)   +4.4.4.2   + unresolved   + Client list: pbr(fd XX)   +6.6.6.1   + unresolved   + Client list: pbr(fd XX)   +6.6.6.2   + unresolved   + Client list: pbr(fd XX)   +6.6.6.3   + unresolved   + Client list: pbr(fd XX)   +6.6.6.4   + unresolved   + Client list: pbr(fd XX)   +192.168.0.2   + resolved via connected   + is directly connected, r1-eth0   + Client list: static(fd XX)   +192.168.0.4   + resolved via connected   + is directly connected, r1-eth0   + Client list: static(fd XX)   +192.168.7.10   + resolved via connected   + is directly connected, r1-eth7   + Client list: bgp(fd XX)   +192.168.7.20(Connected)   + resolved via connected   + is directly connected, r1-eth7   + Client list: bgp(fd XX)   +192.168.161.4   + unresolved   + Client list: pbr(fd XX)    assert 0
E   AssertionError: r1 failed ip nht check:
      --- Actual `show ip nht`
      +++ Expected `show ip nht`
      @@ -1 +1,72 @@
      -
      +1.1.1.1
      + resolved via static
(72 more lines...)
Collapse Failed test_all_protocol_startup test_nht History
TopoTests Ubuntu 18.04 amd64 Part 1 < 1 sec
AssertionError: r1 failed ip nht check:   --- Actual `show ip nht`   +++ Expected `show ip nht`   @@ -1 +1,72 @@   -   +1.1.1.1   + resolved via static   + is directly connected, r1-eth1   + Client list: pbr(fd XX)   +1.1.1.2   + resolved via static   + is directly connected, r1-eth2   + Client list: pbr(fd XX)   +1.1.1.3   + resolved via static   + is directly connected, r1-eth3   + Client list: pbr(fd XX)   +1.1.1.4   + resolved via static   + is directly connected, r1-eth4   + Client list: pbr(fd XX)   +1.1.1.5   + resolved via static   + is directly connected, r1-eth5   + Client list: pbr(fd XX)   +1.1.1.6   + resolved via static   + is directly connected, r1-eth6   + Client list: pbr(fd XX)   +1.1.1.7   + resolved via static   + is directly connected, r1-eth7   + Client list: pbr(fd XX)   +1.1.1.8   + resolved via static   + is directly connected, r1-eth8   + Client list: pbr(fd XX)   +2.2.2.1   + unresolved   + Client list: pbr(fd XX)   +4.4.4.1   + unresolved   + Client list: pbr(fd XX)   +4.4.4.2   + unresolved   + Client list: pbr(fd XX)   +6.6.6.1   + unresolved   + Client list: pbr(fd XX)   +6.6.6.2   + unresolved   + Client list: pbr(fd XX)   +6.6.6.3   + unresolved   + Client list: pbr(fd XX)   +6.6.6.4   + unresolved   + Client list: pbr(fd XX)   +192.168.0.2   + resolved via connected   + is directly connected, r1-eth0   + Client list: static(fd XX)   +192.168.0.4   + resolved via connected   + is directly connected, r1-eth0   + Client list: static(fd XX)   +192.168.7.10   + resolved via connected   + is directly connected, r1-eth7   + Client list: bgp(fd XX)   +192.168.7.20(Connected)   + resolved via connected   + is directly connected, r1-eth7   + Client list: bgp(fd XX)   +192.168.161.4   + unresolved   + Client list: pbr(fd XX)    assert 0
E   AssertionError: r1 failed ip nht check:
      --- Actual `show ip nht`
      +++ Expected `show ip nht`
      @@ -1 +1,72 @@
      -
      +1.1.1.1
      + resolved via static
(72 more lines...)
Collapse Failed test_all_protocol_startup test_router_running History
TopoTests Ubuntu 18.04 amd64 Part 1 8 secs
AssertionError: r1: Daemon pbrd not running assert 'r1: Daemon pbrd not running' == ''   - r1: Daemon pbrd not running
E   AssertionError: r1: Daemon pbrd not running
    assert 'r1: Daemon pbrd not running' == ''
      - r1: Daemon pbrd not running
Collapse Failed test_all_protocol_startup test_router_running History
TopoTests Ubuntu 18.04 arm8 Part 1 9 secs
AssertionError: r1: Daemon pbrd not running assert 'r1: Daemon pbrd not running' == ''   - r1: Daemon pbrd not running
E   AssertionError: r1: Daemon pbrd not running
    assert 'r1: Daemon pbrd not running' == ''
      - r1: Daemon pbrd not running
Collapse Failed test_all_protocol_startup test_nht History
TopoTests Debian 10 amd64 Part 1 < 1 sec
AssertionError: r1 failed ip nht check:   --- Actual `show ip nht`   +++ Expected `show ip nht`   @@ -1 +1,72 @@   -   +1.1.1.1   + resolved via static   + is directly connected, r1-eth1   + Client list: pbr(fd XX)   +1.1.1.2   + resolved via static   + is directly connected, r1-eth2   + Client list: pbr(fd XX)   +1.1.1.3   + resolved via static   + is directly connected, r1-eth3   + Client list: pbr(fd XX)   +1.1.1.4   + resolved via static   + is directly connected, r1-eth4   + Client list: pbr(fd XX)   +1.1.1.5   + resolved via static   + is directly connected, r1-eth5   + Client list: pbr(fd XX)   +1.1.1.6   + resolved via static   + is directly connected, r1-eth6   + Client list: pbr(fd XX)   +1.1.1.7   + resolved via static   + is directly connected, r1-eth7   + Client list: pbr(fd XX)   +1.1.1.8   + resolved via static   + is directly connected, r1-eth8   + Client list: pbr(fd XX)   +2.2.2.1   + unresolved   + Client list: pbr(fd XX)   +4.4.4.1   + unresolved   + Client list: pbr(fd XX)   +4.4.4.2   + unresolved   + Client list: pbr(fd XX)   +6.6.6.1   + unresolved   + Client list: pbr(fd XX)   +6.6.6.2   + unresolved   + Client list: pbr(fd XX)   +6.6.6.3   + unresolved   + Client list: pbr(fd XX)   +6.6.6.4   + unresolved   + Client list: pbr(fd XX)   +192.168.0.2   + resolved via connected   + is directly connected, r1-eth0   + Client list: static(fd XX)   +192.168.0.4   + resolved via connected   + is directly connected, r1-eth0   + Client list: static(fd XX)   +192.168.7.10   + resolved via connected   + is directly connected, r1-eth7   + Client list: bgp(fd XX)   +192.168.7.20(Connected)   + resolved via connected   + is directly connected, r1-eth7   + Client list: bgp(fd XX)   +192.168.161.4   + unresolved   + Client list: pbr(fd XX)    assert 0
E   AssertionError: r1 failed ip nht check:
      --- Actual `show ip nht`
      +++ Expected `show ip nht`
      @@ -1 +1,72 @@
      -
      +1.1.1.1
      + resolved via static
(72 more lines...)
Collapse Failed test_all_protocol_startup test_router_running History
TopoTests Debian 10 amd64 Part 1 13 secs
AssertionError: r1: Daemon pbrd not running assert 'r1: Daemon pbrd not running' == ''   - r1: Daemon pbrd not running
E   AssertionError: r1: Daemon pbrd not running
    assert 'r1: Daemon pbrd not running' == ''
      - r1: Daemon pbrd not running
Collapse Failed test_all_protocol_startup test_nht History
TopoTests Ubuntu 18.04 i386 Part 1 < 1 sec
AssertionError: r1 failed ip nht check:   --- Actual `show ip nht`   +++ Expected `show ip nht`   @@ -1 +1,72 @@   -   +1.1.1.1   + resolved via static   + is directly connected, r1-eth1   + Client list: pbr(fd XX)   +1.1.1.2   + resolved via static   + is directly connected, r1-eth2   + Client list: pbr(fd XX)   +1.1.1.3   + resolved via static   + is directly connected, r1-eth3   + Client list: pbr(fd XX)   +1.1.1.4   + resolved via static   + is directly connected, r1-eth4   + Client list: pbr(fd XX)   +1.1.1.5   + resolved via static   + is directly connected, r1-eth5   + Client list: pbr(fd XX)   +1.1.1.6   + resolved via static   + is directly connected, r1-eth6   + Client list: pbr(fd XX)   +1.1.1.7   + resolved via static   + is directly connected, r1-eth7   + Client list: pbr(fd XX)   +1.1.1.8   + resolved via static   + is directly connected, r1-eth8   + Client list: pbr(fd XX)   +2.2.2.1   + unresolved   + Client list: pbr(fd XX)   +4.4.4.1   + unresolved   + Client list: pbr(fd XX)   +4.4.4.2   + unresolved   + Client list: pbr(fd XX)   +6.6.6.1   + unresolved   + Client list: pbr(fd XX)   +6.6.6.2   + unresolved   + Client list: pbr(fd XX)   +6.6.6.3   + unresolved   + Client list: pbr(fd XX)   +6.6.6.4   + unresolved   + Client list: pbr(fd XX)   +192.168.0.2   + resolved via connected   + is directly connected, r1-eth0   + Client list: static(fd XX)   +192.168.0.4   + resolved via connected   + is directly connected, r1-eth0   + Client list: static(fd XX)   +192.168.7.10   + resolved via connected   + is directly connected, r1-eth7   + Client list: bgp(fd XX)   +192.168.7.20(Connected)   + resolved via connected   + is directly connected, r1-eth7   + Client list: bgp(fd XX)   +192.168.161.4   + unresolved   + Client list: pbr(fd XX)    assert 0
E   AssertionError: r1 failed ip nht check:
      --- Actual `show ip nht`
      +++ Expected `show ip nht`
      @@ -1 +1,72 @@
      -
      +1.1.1.1
      + resolved via static
(72 more lines...)
Collapse Failed test_all_protocol_startup test_router_running History
TopoTests Ubuntu 18.04 i386 Part 1 8 secs
AssertionError: r1: Daemon pbrd not running assert 'r1: Daemon pbrd not running' == ''   - r1: Daemon pbrd not running
E   AssertionError: r1: Daemon pbrd not running
    assert 'r1: Daemon pbrd not running' == ''
      - r1: Daemon pbrd not running
Collapse Failed test_bfd_bgp_cbit_topo3 test_protocols_convergence History
TopoTests Ubuntu 18.04 i386 Part 1 9 secs
AssertionError: r1: Daemon bfdd not running r2: Daemon bfdd not running r3: Daemon bfdd not running
E   AssertionError: r1: Daemon bfdd not running
    r2: Daemon bfdd not running
    r3: Daemon bfdd not running
Collapse Failed test_bfd_bgp_cbit_topo3 test_bfd_comes_back_again History
TopoTests Ubuntu 18.04 amd64 Part 1 14 secs
AssertionError: "r1" JSON output mismatches assert Generated JSON diff error report:      > $: d1 has element of type 'Object' but the corresponding element in d2 is of type 'Array'
E   AssertionError: "r1" JSON output mismatches
    assert Generated JSON diff error report:
      
      > $: d1 has element of type 'Object' but the corresponding element in d2 is of type 'Array'
Collapse Failed test_bfd_bgp_cbit_topo3 test_protocols_convergence History
TopoTests Debian 10 amd64 Part 1 12 secs
AssertionError: r1: Daemon bfdd not running r2: Daemon bfdd not running r3: Daemon bfdd not running
E   AssertionError: r1: Daemon bfdd not running
    r2: Daemon bfdd not running
    r3: Daemon bfdd not running
Collapse Failed test_bfd_bgp_cbit_topo3 test_bfd_comes_back_again History
TopoTests Ubuntu 18.04 i386 Part 1 15 secs
AssertionError: "r1" JSON output mismatches assert Generated JSON diff error report:      > $: d1 has element of type 'Object' but the corresponding element in d2 is of type 'Array'
E   AssertionError: "r1" JSON output mismatches
    assert Generated JSON diff error report:
      
      > $: d1 has element of type 'Object' but the corresponding element in d2 is of type 'Array'
Collapse Failed test_bfd_bgp_cbit_topo3 test_bfd_comes_back_again History
TopoTests Debian 10 amd64 Part 1 14 secs
AssertionError: "r1" JSON output mismatches assert Generated JSON diff error report:      > $: d1 has element of type 'Object' but the corresponding element in d2 is of type 'Array'
E   AssertionError: "r1" JSON output mismatches
    assert Generated JSON diff error report:
      
      > $: d1 has element of type 'Object' but the corresponding element in d2 is of type 'Array'
Collapse Failed test_bfd_bgp_cbit_topo3 test_bfd_comes_back_again History
TopoTests Ubuntu 18.04 arm8 Part 1 18 secs
AssertionError: "r1" JSON output mismatches assert Generated JSON diff error report:      > $: d1 has element of type 'Object' but the corresponding element in d2 is of type 'Array'
E   AssertionError: "r1" JSON output mismatches
    assert Generated JSON diff error report:
      
      > $: d1 has element of type 'Object' but the corresponding element in d2 is of type 'Array'
Collapse Failed test_bfd_bgp_cbit_topo3 test_protocols_convergence History
TopoTests Ubuntu 18.04 arm8 Part 1 14 secs
AssertionError: r1: Daemon bfdd not running r2: Daemon bfdd not running r3: Daemon bfdd not running
E   AssertionError: r1: Daemon bfdd not running
    r2: Daemon bfdd not running
    r3: Daemon bfdd not running
Collapse Failed test_bfd_bgp_cbit_topo3 test_protocols_convergence History
TopoTests Ubuntu 18.04 amd64 Part 1 10 secs
AssertionError: r1: Daemon bfdd not running r2: Daemon bfdd not running r3: Daemon bfdd not running
E   AssertionError: r1: Daemon bfdd not running
    r2: Daemon bfdd not running
    r3: Daemon bfdd not running
Collapse Failed test_bfd_isis_topo1 test_rib_isis_step1 History
TopoTests Ubuntu 18.04 i386 Part 1 13 secs
AssertionError: rt5: Daemon isisd not running rt4: Daemon isisd not running rt1: Daemon isisd not running rt3: Daemon isisd not running rt2: Daemon isisd not running
E   AssertionError: rt5: Daemon isisd not running
    rt4: Daemon isisd not running
    rt1: Daemon isisd not running
    rt3: Daemon isisd not running
    rt2: Daemon isisd not running
Collapse Failed test_bfd_isis_topo1 test_rib_isis_step1 History
TopoTests Ubuntu 18.04 amd64 Part 1 14 secs
AssertionError: rt5: Daemon isisd not running rt4: Daemon isisd not running rt1: Daemon isisd not running rt3: Daemon isisd not running rt2: Daemon isisd not running
E   AssertionError: rt5: Daemon isisd not running
    rt4: Daemon isisd not running
    rt1: Daemon isisd not running
    rt3: Daemon isisd not running
    rt2: Daemon isisd not running
Collapse Failed test_bfd_isis_topo1 test_rib_isis_step1 History
TopoTests Ubuntu 18.04 arm8 Part 1 20 secs
AssertionError: rt5: Daemon isisd not running rt4: Daemon isisd not running rt1: Daemon isisd not running rt3: Daemon isisd not running rt2: Daemon isisd not running
E   AssertionError: rt5: Daemon isisd not running
    rt4: Daemon isisd not running
    rt1: Daemon isisd not running
    rt3: Daemon isisd not running
    rt2: Daemon isisd not running
Collapse Failed test_bfd_isis_topo1 test_rib_isis_step1 History
TopoTests Debian 10 amd64 Part 1 18 secs
AssertionError: rt5: Daemon isisd not running rt4: Daemon isisd not running rt1: Daemon isisd not running rt3: Daemon isisd not running rt2: Daemon isisd not running
E   AssertionError: rt5: Daemon isisd not running
    rt4: Daemon isisd not running
    rt1: Daemon isisd not running
    rt3: Daemon isisd not running
    rt2: Daemon isisd not running
Collapse Failed test_bfd_ospf_topo1 test_rib_ospf_step1 History
TopoTests Ubuntu 18.04 i386 Part 1 14 secs
AssertionError: rt5: Daemon ospfd not running rt4: Daemon ospfd not running rt1: Daemon ospfd not running rt3: Daemon ospfd not running rt2: Daemon ospfd not running
E   AssertionError: rt5: Daemon ospfd not running
    rt4: Daemon ospfd not running
    rt1: Daemon ospfd not running
    rt3: Daemon ospfd not running
    rt2: Daemon ospfd not running
Collapse Failed test_bfd_ospf_topo1 test_rib_ospf_step1 History
TopoTests Debian 10 amd64 Part 1 20 secs
AssertionError: rt5: Daemon ospfd not running rt4: Daemon ospfd not running rt1: Daemon ospfd not running rt3: Daemon ospfd not running rt2: Daemon ospfd not running
E   AssertionError: rt5: Daemon ospfd not running
    rt4: Daemon ospfd not running
    rt1: Daemon ospfd not running
    rt3: Daemon ospfd not running
    rt2: Daemon ospfd not running
Collapse Failed test_bfd_ospf_topo1 test_rib_ospf_step1 History
TopoTests Ubuntu 18.04 arm8 Part 1 23 secs
AssertionError: rt5: Daemon ospfd not running rt4: Daemon ospfd not running rt1: Daemon ospfd not running rt3: Daemon ospfd not running rt2: Daemon ospfd not running
E   AssertionError: rt5: Daemon ospfd not running
    rt4: Daemon ospfd not running
    rt1: Daemon ospfd not running
    rt3: Daemon ospfd not running
    rt2: Daemon ospfd not running
Collapse Failed test_bfd_ospf_topo1 test_rib_ospf_step1 History
TopoTests Ubuntu 18.04 amd64 Part 1 15 secs
AssertionError: rt5: Daemon ospfd not running rt4: Daemon ospfd not running rt1: Daemon ospfd not running rt3: Daemon ospfd not running rt2: Daemon ospfd not running
E   AssertionError: rt5: Daemon ospfd not running
    rt4: Daemon ospfd not running
    rt1: Daemon ospfd not running
    rt3: Daemon ospfd not running
    rt2: Daemon ospfd not running
Collapse Failed test_bfd_profiles_topo1 test_wait_protocols_convergence History
TopoTests Ubuntu 18.04 i386 Part 1 18 secs
AssertionError: r4: Daemon isisd not running r5: Daemon bfdd not running r6: Daemon ospfd not running r1: Daemon ospfd not running r2: Daemon bfdd not running r3: Daemon isisd not running
E   AssertionError: r4: Daemon isisd not running
    r5: Daemon bfdd not running
    r6: Daemon ospfd not running
    r1: Daemon ospfd not running
    r2: Daemon bfdd not running
    r3: Daemon isisd not running
Collapse Failed test_bfd_profiles_topo1 test_wait_protocols_convergence History
TopoTests Debian 10 amd64 Part 1 24 secs
AssertionError: r4: Daemon isisd not running r5: Daemon bfdd not running r6: Daemon ospfd not running r1: Daemon ospfd not running r2: Daemon bfdd not running r3: Daemon isisd not running
E   AssertionError: r4: Daemon isisd not running
    r5: Daemon bfdd not running
    r6: Daemon ospfd not running
    r1: Daemon ospfd not running
    r2: Daemon bfdd not running
    r3: Daemon isisd not running
Collapse Failed test_bfd_profiles_topo1 test_wait_protocols_convergence History
TopoTests Ubuntu 18.04 amd64 Part 1 17 secs
AssertionError: r4: Daemon isisd not running r5: Daemon bfdd not running r6: Daemon ospfd not running r1: Daemon ospfd not running r2: Daemon bfdd not running r3: Daemon isisd not running
E   AssertionError: r4: Daemon isisd not running
    r5: Daemon bfdd not running
    r6: Daemon ospfd not running
    r1: Daemon ospfd not running
    r2: Daemon bfdd not running
    r3: Daemon isisd not running
Collapse Failed test_bfd_profiles_topo1 test_wait_protocols_convergence History
TopoTests Ubuntu 18.04 arm8 Part 1 28 secs
AssertionError: r4: Daemon isisd not running r5: Daemon bfdd not running r6: Daemon ospfd not running r1: Daemon ospfd not running r2: Daemon bfdd not running r3: Daemon isisd not running
E   AssertionError: r4: Daemon isisd not running
    r5: Daemon bfdd not running
    r6: Daemon ospfd not running
    r1: Daemon ospfd not running
    r2: Daemon bfdd not running
    r3: Daemon isisd not running
Collapse Failed test_bfd_topo1 test_bfd_connection History
TopoTests Debian 10 amd64 Part 1 14 secs
AssertionError: r4: Daemon bfdd not running r1: Daemon bfdd not running r2: Daemon bfdd not running r3: Daemon bfdd not running
E   AssertionError: r4: Daemon bfdd not running
    r1: Daemon bfdd not running
    r2: Daemon bfdd not running
    r3: Daemon bfdd not running
Collapse Failed test_bfd_topo1 test_bfd_connection History
TopoTests Ubuntu 18.04 i386 Part 1 12 secs
AssertionError: r4: Daemon bfdd not running r1: Daemon bfdd not running r2: Daemon bfdd not running r3: Daemon bfdd not running
E   AssertionError: r4: Daemon bfdd not running
    r1: Daemon bfdd not running
    r2: Daemon bfdd not running
    r3: Daemon bfdd not running
Collapse Failed test_bfd_topo1 test_bfd_connection History
TopoTests Ubuntu 18.04 amd64 Part 1 11 secs
AssertionError: r4: Daemon bfdd not running r1: Daemon bfdd not running r2: Daemon bfdd not running r3: Daemon bfdd not running
E   AssertionError: r4: Daemon bfdd not running
    r1: Daemon bfdd not running
    r2: Daemon bfdd not running
    r3: Daemon bfdd not running
Collapse Failed test_bfd_topo1 test_bfd_connection History
TopoTests Ubuntu 18.04 arm8 Part 1 18 secs
AssertionError: r4: Daemon bfdd not running r1: Daemon bfdd not running r2: Daemon bfdd not running r3: Daemon bfdd not running
E   AssertionError: r4: Daemon bfdd not running
    r1: Daemon bfdd not running
    r2: Daemon bfdd not running
    r3: Daemon bfdd not running
Collapse Failed test_bfd_topo2 test_protocols_convergence History
TopoTests Ubuntu 18.04 i386 Part 1 15 secs
AssertionError: r4: Daemon ospfd not running r1: Daemon ospfd not running r2: Daemon ospfd not running r3: Daemon ospfd not running
E   AssertionError: r4: Daemon ospfd not running
    r1: Daemon ospfd not running
    r2: Daemon ospfd not running
    r3: Daemon ospfd not running
Collapse Failed test_bfd_topo2 test_protocols_convergence History
TopoTests Debian 10 amd64 Part 1 18 secs
AssertionError: r4: Daemon ospfd not running r1: Daemon ospfd not running r2: Daemon ospfd not running r3: Daemon ospfd not running
E   AssertionError: r4: Daemon ospfd not running
    r1: Daemon ospfd not running
    r2: Daemon ospfd not running
    r3: Daemon ospfd not running
Collapse Failed test_bfd_topo2 test_protocols_convergence History
TopoTests Ubuntu 18.04 amd64 Part 1 16 secs
AssertionError: r4: Daemon ospfd not running r1: Daemon ospfd not running r2: Daemon ospfd not running r3: Daemon ospfd not running
E   AssertionError: r4: Daemon ospfd not running
    r1: Daemon ospfd not running
    r2: Daemon ospfd not running
    r3: Daemon ospfd not running
Collapse Failed test_bfd_topo2 test_protocols_convergence History
TopoTests Ubuntu 18.04 arm8 Part 1 24 secs
AssertionError: r4: Daemon ospfd not running r1: Daemon ospfd not running r2: Daemon ospfd not running r3: Daemon ospfd not running
E   AssertionError: r4: Daemon ospfd not running
    r1: Daemon ospfd not running
    r2: Daemon ospfd not running
    r3: Daemon ospfd not running
Collapse Failed test_bfd_topo3 test_wait_bgp_convergence History
TopoTests Ubuntu 18.04 i386 Part 1 12 secs
AssertionError: r4: Daemon bfdd not running r1: Daemon bfdd not running r2: Daemon bfdd not running r3: Daemon bfdd not running
E   AssertionError: r4: Daemon bfdd not running
    r1: Daemon bfdd not running
    r2: Daemon bfdd not running
    r3: Daemon bfdd not running
Collapse Failed test_bfd_topo3 test_wait_bgp_convergence History
TopoTests Debian 10 amd64 Part 1 14 secs
AssertionError: r4: Daemon bfdd not running r1: Daemon bfdd not running r2: Daemon bfdd not running r3: Daemon bfdd not running
E   AssertionError: r4: Daemon bfdd not running
    r1: Daemon bfdd not running
    r2: Daemon bfdd not running
    r3: Daemon bfdd not running
Collapse Failed test_bfd_topo3 test_wait_bgp_convergence History
TopoTests Ubuntu 18.04 amd64 Part 1 11 secs
AssertionError: r4: Daemon bfdd not running r1: Daemon bfdd not running r2: Daemon bfdd not running r3: Daemon bfdd not running
E   AssertionError: r4: Daemon bfdd not running
    r1: Daemon bfdd not running
    r2: Daemon bfdd not running
    r3: Daemon bfdd not running
Collapse Failed test_bfd_topo3 test_wait_bgp_convergence History
TopoTests Ubuntu 18.04 arm8 Part 1 18 secs
AssertionError: r4: Daemon bfdd not running r1: Daemon bfdd not running r2: Daemon bfdd not running r3: Daemon bfdd not running
E   AssertionError: r4: Daemon bfdd not running
    r1: Daemon bfdd not running
    r2: Daemon bfdd not running
    r3: Daemon bfdd not running
Collapse Failed test_bfd_vrf_topo1 test_bfd_connection History
TopoTests Debian 10 amd64 Part 1 16 secs
AssertionError: r4: Daemon bfdd not running r1: Daemon bfdd not running r2: Daemon bfdd not running r3: Daemon bfdd not running
E   AssertionError: r4: Daemon bfdd not running
    r1: Daemon bfdd not running
    r2: Daemon bfdd not running
    r3: Daemon bfdd not running
Collapse Failed test_bfd_vrf_topo1 test_bfd_connection History
TopoTests Ubuntu 18.04 amd64 Part 1 11 secs
AssertionError: r4: Daemon bfdd not running r1: Daemon bfdd not running r2: Daemon bfdd not running r3: Daemon bfdd not running
E   AssertionError: r4: Daemon bfdd not running
    r1: Daemon bfdd not running
    r2: Daemon bfdd not running
    r3: Daemon bfdd not running
Collapse Failed test_bfd_vrf_topo1 test_bfd_connection History
TopoTests Ubuntu 18.04 arm8 Part 1 19 secs
AssertionError: r4: Daemon bfdd not running r1: Daemon bfdd not running r2: Daemon bfdd not running r3: Daemon bfdd not running
E   AssertionError: r4: Daemon bfdd not running
    r1: Daemon bfdd not running
    r2: Daemon bfdd not running
    r3: Daemon bfdd not running
Collapse Failed test_bfd_vrf_topo1 test_bfd_connection History
TopoTests Ubuntu 18.04 i386 Part 1 12 secs
AssertionError: r4: Daemon bfdd not running r1: Daemon bfdd not running r2: Daemon bfdd not running r3: Daemon bfdd not running
E   AssertionError: r4: Daemon bfdd not running
    r1: Daemon bfdd not running
    r2: Daemon bfdd not running
    r3: Daemon bfdd not running
Collapse Failed test_bgp_aggregate-address_origin test_bgp_aggregate_address_origin History
TopoTests Ubuntu 18.04 amd64 Part 1 5 secs
AssertionError: r1: Daemon zebra not running r2: Daemon zebra not running
E   AssertionError: r1: Daemon zebra not running
    r2: Daemon zebra not running
Collapse Failed test_bgp_aggregate-address_origin test_bgp_aggregate_address_origin History
TopoTests Ubuntu 18.04 arm8 Part 1 9 secs
AssertionError: r1: Daemon zebra not running r2: Daemon zebra not running
E   AssertionError: r1: Daemon zebra not running
    r2: Daemon zebra not running
Collapse Failed test_bgp_aggregate-address_origin test_bgp_aggregate_address_origin History
TopoTests Ubuntu 18.04 i386 Part 1 6 secs
AssertionError: r1: Daemon zebra not running r2: Daemon zebra not running
E   AssertionError: r1: Daemon zebra not running
    r2: Daemon zebra not running
Collapse Failed test_bgp_aggregate-address_origin test_bgp_aggregate_address_origin History
TopoTests Debian 10 amd64 Part 1 7 secs
AssertionError: r1: Daemon zebra not running r2: Daemon zebra not running
E   AssertionError: r1: Daemon zebra not running
    r2: Daemon zebra not running
Collapse Failed test_bgp_aggregate-address_route-map test_bgp_maximum_prefix_invalid History
TopoTests Ubuntu 18.04 amd64 Part 1 5 secs
AssertionError: r1: Daemon zebra not running r2: Daemon zebra not running
E   AssertionError: r1: Daemon zebra not running
    r2: Daemon zebra not running
Collapse Failed test_bgp_aggregate-address_route-map test_bgp_maximum_prefix_invalid History
TopoTests Debian 10 amd64 Part 1 7 secs
AssertionError: r1: Daemon zebra not running r2: Daemon zebra not running
E   AssertionError: r1: Daemon zebra not running
    r2: Daemon zebra not running