FreeRangeRouting Github Pull Request Testing

Build: #19576 failed Custom build by Github Hook with revision master

Stages & jobs

  1. Get Sourcecode

  2. Building Stage

  3. Basic Tests

  4. Final

    Final

Build result summary

Details

Completed
Duration
364 minutes
Flags
Custom revisionCustom build
Labels
version=8_1-dev-327-g4da08e016git=https_//github_com/frrouting/frr_gitbuildurl=https_//ci1_netdef_org/browse/frr-frrpullreq-19576branch=master
Revision
352cc841d897eb343f12d7f85c7f346ab3c29beb 352cc841d897eb343f12d7f85c7f346ab3c29beb
Total tests
12589
Failing since
#19574 (Custom build by Github Hook with revision master)
Fixed in
#19595 (Custom build by Github Hook with revision master)

Tests

Custom variables

Custom revision
352cc841d897eb343f12d7f85c7f346ab3c29beb 352cc841d897eb343f12d7f85c7f346ab3c29beb
Name Value
github_base_sha 352cc841d897eb343f12d7f85c7f346ab3c29beb
github_pullreq 8838
github_repo FRRouting/frr
github_merge_sha 4da08e016b5753558ffe61db532af8a2f9b6a8a5
github_branch master

Comments

  1. Github Hook

    GitHub Merge Request 8838
    for GitHub Repo FRRouting/frr, branch master

    Request to merge from LabNConsulting/frr
    Merge Git Commit ID 4da08e016b5753558ffe61db532af8a2f9b6a8a5 on top of base Git Commit ID 352cc841d897eb343f12d7f85c7f346ab3c29beb

Code commits

Author Commit Message Commit date
Igor Ryzhov <iryzhov@nfware.com> Igor Ryzhov <iryzhov@nfware.com> 352cc841d897eb343f12d7f85c7f346ab3c29beb 352cc841d897eb343f12d7f85c7f346ab3c29beb Merge pull request #8831 from sworleys/Fix-No-Ospf-Func
ospf6d: fix undefined function

Tests

New test failures 2
Status Test View job Duration
Collapse Failed test_bfd_topo2 test_protocols_convergence History
TopoTests Ubuntu 18.04 i386 Part 1 2 mins
AssertionError: "r2" JSON output mismatches assert Generated JSON diff error report:      > $: d2 has key '10.254.254.1/32' which is not present in d1
E   AssertionError: "r2" JSON output mismatches
    assert Generated JSON diff error report:
      
      > $: d2 has key '10.254.254.1/32' which is not present in d1
Collapse Failed test_ospf_routemaps test_ospf_routemaps_functionality_tc21_p0 History
TopoTests Ubuntu 18.04 arm8 Part 9 3 mins
AssertionError: Testcase test_ospf_routemaps_functionality_tc21_p0 : Failed     Error: [DUT: r1]: Missing route in RIB, routes: ['11.0.20.1/32', '11.0.20.2/32', '11.0.20.3/32', '11.0.20.4/32', '11.0.20.5/32'] assert "[DUT: r1]: Missing route in RIB, routes: ['11.0.20.1/32', '11.0.20.2/32', '11.0.20.3/32', '11.0.20.4/32', '11.0.20.5/32']" is True
E   AssertionError: Testcase test_ospf_routemaps_functionality_tc21_p0 : Failed 
       Error: [DUT: r1]: Missing route in RIB, routes: ['11.0.20.1/32', '11.0.20.2/32', '11.0.20.3/32', '11.0.20.4/32', '11.0.20.5/32']
    assert "[DUT: r1]: Missing route in RIB, routes: ['11.0.20.1/32', '11.0.20.2/32', '11.0.20.3/32', '11.0.20.4/32', '11.0.20.5/32']" is True