FreeRangeRouting Github Pull Request Testing

Build: #5812 failed Custom build by Github Hook with revision master

Test results

  • 5,960 tests in total
  • 2 tests failed
  • 2 failures are new
  • 37 tests were quarantined / skipped
  • 96 minutes taken in total.
New test failures 2
Status Test View job Duration
Collapse Failed test_bgp_ecmp_topo1 test_bgp_convergence History
Topology Tests on Ubuntu 16.04 amd64 54 secs
AssertionError: BGP router network did not converge assert json["ipv4Unicast"]["vrfName"] value is different (   --- Expected value   +++ Current value   @@ -1 +1 @@   -"Default"   +"default")
E   AssertionError: BGP router network did not converge
    assert json["ipv4Unicast"]["vrfName"] value is different (
      --- Expected value
      +++ Current value
      @@ -1 +1 @@
      -"Default"
      +"default")
Collapse Failed test_bgp_ecmp_topo1 test_bgp_convergence History
TopoTest Tests on Ubuntu 16.04 i386 55 secs
AssertionError: BGP router network did not converge assert json["ipv4Unicast"]["vrfName"] value is different (   --- Expected value   +++ Current value   @@ -1 +1 @@   -"Default"   +"default")
E   AssertionError: BGP router network did not converge
    assert json["ipv4Unicast"]["vrfName"] value is different (
      --- Expected value
      +++ Current value
      @@ -1 +1 @@
      -"Default"
      +"default")
Skipped tests 37
Status Test Failing since View job
Skipped test_bgp_l3vpn_to_bgp_vrf test_check_linux_vrf History
Topology Tests on Ubuntu 16.04 amd64
Skipped test_bgp_l3vpn_to_bgp_vrf test_check_linux_mpls History
Topology Tests on Ubuntu 16.04 amd64
Skipped test_bgp_l3vpn_to_bgp_vrf test_check_linux_mpls History
TopoTest Tests on Ubuntu 16.04 i386
Skipped test_bgp_l3vpn_to_bgp_vrf test_check_linux_vrf History
TopoTest Tests on Ubuntu 16.04 i386
Skipped test_bgp_vrf_netns_topo test_bgp_vrf_learn History
TopoTest Tests on Ubuntu 16.04 i386
Skipped test_bgp_vrf_netns_topo test_bgp_convergence History
TopoTest Tests on Ubuntu 16.04 i386
Skipped test_bgp_vrf_netns_topo test_bgp_vrf_netns History
TopoTest Tests on Ubuntu 16.04 i386
Skipped TestCommands test_refout History
CentOS 6 amd64 build
Skipped TestCommands test_refout History
CentOS 7 amd64 build
Skipped TestCommands test_refout History
Debian 8 amd64 build
Skipped TestCommands test_refout History
Debian 9 amd64 build
Skipped TestCommands test_refout History
Fedora 24 amd64 build
Skipped TestCommands test_refout History
FreeBSD 10 amd64 build
Skipped TestCommands test_refout History
FreeBSD 11 amd64 build
Skipped TestCommands test_refout History
NetBSD 6 amd64 build
Skipped TestCommands test_refout History
NetBSD 7 amd64 build
Skipped TestCommands test_refout History
OpenBSD 6 amd64 build
Skipped TestCommands test_refout History
Ubuntu 14.04 amd64 build
Skipped TestCommands test_refout History
Ubuntu 16.04 amd64 build
Skipped TestCommands test_refout History
Ubuntu 16.04 i386 build
Skipped TestCommands test_refout History
Ubuntu 18.04 amd64 build
Skipped TestZMQ test_refout History
CentOS 6 amd64 build
Skipped TestZMQ test_refout History
CentOS 7 amd64 build
Skipped TestZMQ test_refout History
Debian 8 amd64 build
Skipped TestZMQ test_refout History
Debian 9 amd64 build
Skipped TestZMQ test_refout History
Fedora 24 amd64 build
Skipped TestZMQ test_refout History
FreeBSD 10 amd64 build
Skipped TestZMQ test_refout History
FreeBSD 11 amd64 build
Skipped TestZMQ test_refout History
NetBSD 6 amd64 build
Skipped TestZMQ test_refout History
NetBSD 7 amd64 build
Skipped TestZMQ test_refout History
OpenBSD 6 amd64 build
Skipped TestZMQ test_refout History
Ubuntu 14.04 amd64 build
Skipped TestZMQ test_refout History
Ubuntu 16.04 amd64 build
Skipped TestZMQ test_refout History
Ubuntu 16.04 i386 build
Skipped TestZMQ test_refout History
Ubuntu 18.04 amd64 build
Skipped test_lm-proxy-topo1 test_lm_proxy History
Topology Tests on Ubuntu 16.04 amd64
Skipped test_lm-proxy-topo1 test_lm_proxy History
TopoTest Tests on Ubuntu 16.04 i386