FreeRangeRouting Github Pull Request Testing

Build: #6327 failed Rebuilt by Donald Sharp

Build result summary

Details

Completed
Duration
91 minutes
Flags
Custom revisionCustom build
Labels
version=frr-6_1-dev-1714-g943d595a0git=https_//github_com/frrouting/frr_gitbuildurl=https_//ci1_netdef_org/browse/frr-frrpullreq-6327branch=master
Revision
master master
Total tests
6104
Fixed in
#6329 (Rebuilt by Donald Sharp)
Number of retries
1

Custom variables

Custom revision
master master
Name Value
github_base_sha e82d19a3d414697b59f5e0253594960c0d8fd6d9
github_pullreq 3575
github_branch master
github_repo FRRouting/frr
github_merge_sha 943d595a018e69b550db08cccba1d0778a86705a

Comments

  1. Github Hook

    GitHub Merge Request 3575
    for GitHub Repo FRRouting/frr, branch master

    Request to merge from LabNConsulting/frr
    Merge Git Commit ID 943d595a018e69b550db08cccba1d0778a86705a on top of base Git Commit ID e82d19a3d414697b59f5e0253594960c0d8fd6d9

Code commits

Author Commit Message Commit date
Donald Sharp Donald Sharp e82d19a3d414697b59f5e0253594960c0d8fd6d9 e82d19a3d414697b59f5e0253594960c0d8fd6d9 bgpd: Modify End of Rib notification to INFO
The End of Rib notification in BGP is useful to know no matter
the circumstances.  So change this from a debug message to
an info and cleanup the message a bit and add vrf we are in.

Signed-off-by: Donald Sharp <sharpd@cumulusnetworks.com>

Tests

New test failures 6
Status Test View job Duration
Collapse Failed test_bgp_rfapi_basic_sanity_config2 test_check_close History
Topology Tests on Ubuntu 16.04 amd64 23 secs
AssertionError: 2 tests failed
E   AssertionError: 2 tests failed
Collapse Failed test_bgp_rfapi_basic_sanity_config2 test_check_close History
Topology Tests on Ubuntu 18.04 amd64 23 secs
AssertionError: 2 tests failed
E   AssertionError: 2 tests failed
Collapse Failed test_bgp_rfapi_basic_sanity_config2 test_check_close History
TopoTest Tests on Ubuntu 16.04 i386 23 secs
AssertionError: 2 tests failed
E   AssertionError: 2 tests failed
Collapse Failed test_bgp_rfapi_basic_sanity test_check_close History
Topology Tests on Ubuntu 16.04 amd64 23 secs
AssertionError: 2 tests failed
E   AssertionError: 2 tests failed
Collapse Failed test_bgp_rfapi_basic_sanity test_check_close History
Topology Tests on Ubuntu 18.04 amd64 24 secs
AssertionError: 2 tests failed
E   AssertionError: 2 tests failed
Collapse Failed test_bgp_rfapi_basic_sanity test_check_close History
TopoTest Tests on Ubuntu 16.04 i386 23 secs
AssertionError: 2 tests failed
E   AssertionError: 2 tests failed