FreeRangeRouting Github Pull Request Testing

Build: #6335 failed Custom build by Github Hook with revision dev/7.0

Build result summary

Details

Completed
Duration
78 minutes
Flags
Custom revisionCustom build
Labels
version=frr-6_1-dev-1691-g54544f3a4git=https_//github_com/frrouting/frr_gitbuildurl=https_//ci1_netdef_org/browse/frr-frrpullreq-6335branch=dev/7_0
Revision
dev/7.0 dev/7.0
Total tests
6104
Failing since
#6334 (Custom build by Github Hook with revision master)
Fixed in
#6336 (Custom build by Github Hook with revision stable/5.0)

Tests

Custom variables

Custom revision
dev/7.0 dev/7.0
Name Value
github_base_sha c05f659a58466dd1a8dfe2a2ebbefeeb0b9c8ee0
github_pullreq 3576
github_branch dev/7.0
github_repo FRRouting/frr
github_merge_sha 54544f3a4a511047236423d021c517354f6ced3e

Comments

  1. Github Hook

    GitHub Merge Request 3576
    for GitHub Repo FRRouting/frr, branch dev/7.0

    Request to merge from LabNConsulting/frr
    Merge Git Commit ID 54544f3a4a511047236423d021c517354f6ced3e on top of base Git Commit ID c05f659a58466dd1a8dfe2a2ebbefeeb0b9c8ee0

Code commits

Author Commit Message Commit date
Quentin Young Quentin Young c05f659a58466dd1a8dfe2a2ebbefeeb0b9c8ee0 c05f659a58466dd1a8dfe2a2ebbefeeb0b9c8ee0 Merge pull request #3561 from opensourcerouting/northbound-freebsd-fix
lib: fix segfault on freebsd when using vsnprintf() incorrectly

Tests

New test failures 3
Status Test View job Duration
Collapse Failed test_bgp_rfapi_basic_sanity_config2 test_check_close History
Topology Tests on Ubuntu 16.04 amd64 23 secs
AssertionError: 2 tests failed
E   AssertionError: 2 tests failed
Collapse Failed test_bgp_rfapi_basic_sanity_config2 test_check_close History
Topology Tests on Ubuntu 18.04 amd64 23 secs
AssertionError: 2 tests failed
E   AssertionError: 2 tests failed
Collapse Failed test_bgp_rfapi_basic_sanity_config2 test_check_close History
TopoTest Tests on Ubuntu 16.04 i386 23 secs
AssertionError: 2 tests failed
E   AssertionError: 2 tests failed