FreeRangeRouting Github Pull Request Testing

Build: #6366 failed Custom build by Github Hook with revision dev/7.0

Build result summary

Details

Completed
Duration
79 minutes
Flags
Custom revisionCustom build
Labels
version=frr-6_1-dev-1702-g89ab75af5git=https_//github_com/frrouting/frr_gitbuildurl=https_//ci1_netdef_org/browse/frr-frrpullreq-6366branch=dev/7_0
Revision
dev/7.0 dev/7.0
Total tests
6104
Fixed in
#6368 (Rebuilt by Donald Sharp)

Custom variables

Custom revision
dev/7.0 dev/7.0
Name Value
github_base_sha 8de312fd4ea87ac344162234c13abc68b8b20cd9
github_pullreq 3594
github_branch dev/7.0
github_repo FRRouting/frr
github_merge_sha 89ab75af51a8c4e2c31290c83c58eedfb104821a

Comments

  1. Github Hook

    GitHub Merge Request 3594
    for GitHub Repo FRRouting/frr, branch dev/7.0

    Request to merge from pguibert6WIND/frr
    Merge Git Commit ID 89ab75af51a8c4e2c31290c83c58eedfb104821a on top of base Git Commit ID 8de312fd4ea87ac344162234c13abc68b8b20cd9

Code commits

Author Commit Message Commit date
Donald Sharp Donald Sharp 8de312fd4ea87ac344162234c13abc68b8b20cd9 8de312fd4ea87ac344162234c13abc68b8b20cd9 Merge pull request #3585 from pguibert6WIND/fix_vrf_netns_broken_70
zebra: update local ns_id field

Tests

New test failures 3
Status Test View job Duration
Collapse Failed test_bfd_topo1 test_bgp_convergence History
TopoTest Tests on Ubuntu 16.04 i386 20 secs
AssertionError: r2: bgp did not converge assert json["ipv4Unicast"]["peers"]["192.168.1.1"]["state"] value is different (   --- Expected value   +++ Current value   @@ -1 +1 @@   -"Established"   +"Idle")
E   AssertionError: r2: bgp did not converge
    assert json["ipv4Unicast"]["peers"]["192.168.1.1"]["state"] value is different (
      --- Expected value
      +++ Current value
      @@ -1 +1 @@
      -"Established"
      +"Idle")
Collapse Failed test_bfd_topo1 test_bgp_fast_convergence History
TopoTest Tests on Ubuntu 16.04 i386 39 secs
AssertionError: r4: bgp did not converge assert expected key(s) [u'10.254.254.3/32'] in json["routes"] (have [u'10.254.254.4/32', u'10.254.254.2/32', u'10.254.254.1/32']):   --- Expected value   +++ Current value   @@ -4,0 +5,2 @@   +            "bestpath": true,    +            "network": "10.254.254.1/32",    @@ -11,0 +14,3 @@   +            "origin": "IGP",    +            "path": "102 101",    +            "pathFrom": "external",    @@ -15 +20,2 @@   -            "valid": true   +            "valid": true,    +            "weight": 0   @@ -20,0 +27,4 @@   +            "bestpath": true,    +            "med": 0,    +            "metric": 0,    +            "network": "10.254.254.2/32",    @@ -27,0 +38,3 @@   +            "origin": "IGP",    +            "path": "102",    +            "pathFrom": "external",    @@ -31 +44,2 @@   -            "valid": true   +            "valid": true,    +            "weight": 0   @@ -34 +48 @@   -    "10.254.254.3/32": [   +    "10.254.254.4/32": [   @@ -36 +50,5 @@   -            "aspath": "102 103",    +            "aspath": "",    +            "bestpath": true,    +            "med": 0,    +            "metric": 0,    +            "network": "10.254.254.4/32",    @@ -40 +58 @@   -                    "ip": "192.168.2.2",    +                    "ip": "0.0.0.0",    @@ -44,2 +62,5 @@   -            "peerId": "192.168.2.2",    -            "prefix": "10.254.254.3",    +            "origin": "IGP",    +            "path": "",    +            "pathFrom": "external",    +            "peerId": "(unspec)",    +            "prefix": "10.254.254.4",    @@ -47 +68,2 @@   -            "valid": true   +            "valid": true,    +            "weight": 32768
E   AssertionError: r4: bgp did not converge
    assert expected key(s) [u'10.254.254.3/32'] in json["routes"] (have [u'10.254.254.4/32', u'10.254.254.2/32', u'10.254.254.1/32']):
      --- Expected value
      +++ Current value
      @@ -4,0 +5,2 @@
      +            "bestpath": true, 
      +            "network": "10.254.254.1/32", 
(46 more lines...)
Collapse Failed test_bfd_topo1 test_bgp_fast_reconvergence History
TopoTest Tests on Ubuntu 16.04 i386 5 secs
AssertionError: r4: bgp did not converge assert expected key(s) [u'10.254.254.3/32'] in json["routes"] (have [u'10.254.254.4/32', u'10.254.254.2/32']):   --- Expected value   +++ Current value   @@ -2 +1,0 @@   -    "10.254.254.1/32": null,    @@ -5,0 +5,4 @@   +            "bestpath": true,    +            "med": 0,    +            "metric": 0,    +            "network": "10.254.254.2/32",    @@ -12,0 +16,3 @@   +            "origin": "IGP",    +            "path": "102",    +            "pathFrom": "external",    @@ -16 +22,2 @@   -            "valid": true   +            "valid": true,    +            "weight": 0   @@ -19 +26 @@   -    "10.254.254.3/32": [   +    "10.254.254.4/32": [   @@ -21 +28,5 @@   -            "aspath": "102 103",    +            "aspath": "",    +            "bestpath": true,    +            "med": 0,    +            "metric": 0,    +            "network": "10.254.254.4/32",    @@ -25 +36 @@   -                    "ip": "192.168.2.2",    +                    "ip": "0.0.0.0",    @@ -29,2 +40,5 @@   -            "peerId": "192.168.2.2",    -            "prefix": "10.254.254.3",    +            "origin": "IGP",    +            "path": "",    +            "pathFrom": "external",    +            "peerId": "(unspec)",    +            "prefix": "10.254.254.4",    @@ -32 +46,2 @@   -            "valid": true   +            "valid": true,    +            "weight": 32768
E   AssertionError: r4: bgp did not converge
    assert expected key(s) [u'10.254.254.3/32'] in json["routes"] (have [u'10.254.254.4/32', u'10.254.254.2/32']):
      --- Expected value
      +++ Current value
      @@ -2 +1,0 @@
      -    "10.254.254.1/32": null, 
      @@ -5,0 +5,4 @@
(37 more lines...)