FreeRangeRouting Github Pull Request Testing

Build: #6416 failed Custom build by Github Hook with revision master

Build result summary

Details

Completed
Duration
63 minutes
Flags
Custom revisionCustom build
Labels
version=frr-6_1-dev-1814-gb0d38b8abgit=https_//github_com/frrouting/frr_gitbuildurl=https_//ci1_netdef_org/browse/frr-frrpullreq-6416branch=master
Revision
master master
Total tests
6104
Failing since
#6415 (Custom build by Github Hook with revision master)
Fixed in
#6418 (Custom build by Github Hook with revision master)

Tests

Custom variables

Custom revision
master master
Name Value
github_base_sha c5ef74c4bce161c1ebe19aaab4837291fce10d25
github_pullreq 3616
github_branch master
github_repo FRRouting/frr
github_merge_sha b0d38b8abcd0a63645d813b9e59ec94e39e271d0

Comments

  1. Github Hook

    GitHub Merge Request 3616
    for GitHub Repo FRRouting/frr, branch master

    Request to merge from donaldsharp/frr
    Merge Git Commit ID b0d38b8abcd0a63645d813b9e59ec94e39e271d0 on top of base Git Commit ID c5ef74c4bce161c1ebe19aaab4837291fce10d25

Code commits

Author Commit Message Commit date
Jafar Al-Gharaibeh <Jafaral@users.noreply.github.com> Jafar Al-Gharaibeh <Jafaral@users.noreply.github.com> c5ef74c4bce161c1ebe19aaab4837291fce10d25 c5ef74c4bce161c1ebe19aaab4837291fce10d25 Merge pull request #3617 from donaldsharp/cleanup_old_stale_netlink
zebra: Cleanup unnecessary check

Tests

New test failures 3
Status Test View job Duration
Collapse Failed test_bgp_l3vpn_to_bgp_direct test_memory_leak History
TopoTest Tests on Ubuntu 16.04 i386 5 secs
AssertionError:  r4: zebra crashed. Core file found - Backtrace follows: [New LWP 9100] [New LWP 9117] [New LWP 9101] [Thread debugging using libthread_db enabled] Using host libthread_db library "/lib/i386-linux-gnu/libthread_db.so.1". Core was generated by `/usr/lib/frr/zebra'. Program terminated with signal SIGABRT, Aborted. #0  0xb7f5ed05 in ?? () [Current thread is 1 (Thread 0xb78c67c0 (LWP 9100))] #0  0xb7f5ed05 in ?? () #1  <signal handler called> #2  0x0052e096 in rib_process_after (ctx=0x159d980) at zebra/zebra_rib.c:1944 #3  rib_process_dplane_results (thread=0xbffe02f0) at zebra/zebra_rib.c:3237 #4  0xb7ef46a9 in thread_call (thread=0xbffe02f0) at lib/thread.c:1606 #5  0xb7ec77f1 in frr_run (master=0x129cf70) at lib/libfrr.c:1011 #6  0x0050720d in main (argc=1, argv=0xbffe0634) at zebra/main.c:482
E   AssertionError: 
    r4: zebra crashed. Core file found - Backtrace follows:
    [New LWP 9100]
    [New LWP 9117]
    [New LWP 9101]
    [Thread debugging using libthread_db enabled]
    Using host libthread_db library "/lib/i386-linux-gnu/libthread_db.so.1".
(11 more lines...)
Collapse Failed test_ripng_topo1 test_shutdown_check_memleak History
Topology Tests on Ubuntu 18.04 amd64 3 secs
test teardown failure
E   AssertionError: 
    r2: zebra crashed. Core file found - Backtrace follows:
    [New LWP 12708]
    [New LWP 12723]
    [New LWP 12730]
    [New LWP 12709]
    [Thread debugging using libthread_db enabled]
(15 more lines...)
Collapse Failed test_ripng_topo1 test_shutdown_check_memleak History
TopoTest Tests on Ubuntu 16.04 i386 3 secs
test teardown failure
E   AssertionError: 
    r2: zebra crashed. Core file found - Backtrace follows:
    [New LWP 25311]
    [New LWP 25312]
    [New LWP 25333]
    [New LWP 25326]
    [Thread debugging using libthread_db enabled]
(13 more lines...)