FreeRangeRouting Github Pull Request Testing

Build: #6615 failed Custom build by Github Hook with revision master

Build result summary

Details

Completed
Duration
71 minutes
Flags
Custom revisionCustom build
Labels
version=frr-7_1-dev-63-gd3cefb32fgit=https_//github_com/frrouting/frr_gitbuildurl=https_//ci1_netdef_org/browse/frr-frrpullreq-6615branch=master
Revision
master master
Total tests
5685
Failing since
#6613 (Custom build by Github Hook with revision master)
Fixed in
#6616 (Custom build by Github Hook with revision stable/6.0)

Custom variables

Custom revision
master master
Name Value
github_base_sha 4634d02cfd86685156b29c8084a979749efe15e2
github_pullreq 3715
github_branch master
github_repo FRRouting/frr
github_merge_sha d3cefb32f0910b41749ecd4f2e442f90d13ec7d8

Comments

  1. Github Hook

    GitHub Merge Request 3715
    for GitHub Repo FRRouting/frr, branch master

    Request to merge from qlyoung/frr
    Merge Git Commit ID d3cefb32f0910b41749ecd4f2e442f90d13ec7d8 on top of base Git Commit ID 4634d02cfd86685156b29c8084a979749efe15e2

Code commits

Author Commit Message Commit date
Donald Sharp Donald Sharp 4634d02cfd86685156b29c8084a979749efe15e2 4634d02cfd86685156b29c8084a979749efe15e2 Merge pull request #3684 from mjstapp/dplane_pw
zebra: async dataplane for pseudowires

Tests

New test failures 2
Status Test View job Duration
Collapse Failed test_bgp_rfapi_basic_sanity_config2 test_adjacencies History
TopoTest Tests on Ubuntu 16.04 i386 1 min
AssertionError: 2 tests failed
E   AssertionError: 2 tests failed
Collapse Failed test_bgp_rfapi_basic_sanity test_adjacencies History
TopoTest Tests on Ubuntu 16.04 i386 1 min
AssertionError: 2 tests failed
E   AssertionError: 2 tests failed