FreeRangeRouting Github Pull Request Testing

Build: #6630 failed Custom build by Github Hook with revision master

Build result summary

Details

Completed
Duration
93 minutes
Flags
Custom revisionCustom build
Labels
version=frr-7_1-dev-155-gb55816293git=https_//github_com/frrouting/frr_gitbuildurl=https_//ci1_netdef_org/browse/frr-frrpullreq-6630branch=master
Revision
master master
Total tests
5685
Fixed in
#6632 (Custom build by Github Hook with revision dev/7.0)

Tests

Custom variables

Custom revision
master master
Name Value
github_base_sha 4634d02cfd86685156b29c8084a979749efe15e2
github_pullreq 3747
github_branch master
github_repo FRRouting/frr
github_merge_sha b5581629398aa894f57464bdab1a209033e4189b

Comments

  1. Github Hook

    GitHub Merge Request 3747
    for GitHub Repo FRRouting/frr, branch master

    Request to merge from pguibert6WIND/frr
    Merge Git Commit ID b5581629398aa894f57464bdab1a209033e4189b on top of base Git Commit ID 4634d02cfd86685156b29c8084a979749efe15e2

Code commits

Author Commit Message Commit date
Donald Sharp Donald Sharp 4634d02cfd86685156b29c8084a979749efe15e2 4634d02cfd86685156b29c8084a979749efe15e2 Merge pull request #3684 from mjstapp/dplane_pw
zebra: async dataplane for pseudowires

Tests

New test failures 3
Status Test View job Duration
Collapse Failed test_bfd_topo1 test_bgp_convergence History
TopoTest Tests on Ubuntu 16.04 i386 3 mins
AssertionError: r1: bgp did not converge assert json["ipv4Unicast"]["peers"]["192.168.0.2"]["state"] value is different (   --- Expected value   +++ Current value   @@ -1 +1 @@   -"Established"   +"Idle")
E   AssertionError: r1: bgp did not converge
    assert json["ipv4Unicast"]["peers"]["192.168.0.2"]["state"] value is different (
      --- Expected value
      +++ Current value
      @@ -1 +1 @@
      -"Established"
      +"Idle")
Collapse Failed test_bfd_topo1 test_bgp_fast_convergence History
TopoTest Tests on Ubuntu 16.04 i386 38 secs
AssertionError: r4: bgp did not converge assert expected key(s) [u'10.254.254.1/32'] in json["routes"] (have [u'10.254.254.4/32', u'10.254.254.3/32', u'10.254.254.2/32']):   --- Expected value   +++ Current value   @@ -2 +2 @@   -    "10.254.254.1/32": [   +    "10.254.254.2/32": [   @@ -4 +4,5 @@   -            "aspath": "102 101",    +            "aspath": "102",    +            "bestpath": true,    +            "med": 0,    +            "metric": 0,    +            "network": "10.254.254.2/32",    @@ -11,0 +16,3 @@   +            "origin": "IGP",    +            "path": "102",    +            "pathFrom": "external",    @@ -13 +20 @@   -            "prefix": "10.254.254.1",    +            "prefix": "10.254.254.2",    @@ -15 +22,2 @@   -            "valid": true   +            "valid": true,    +            "weight": 0   @@ -18 +26 @@   -    "10.254.254.2/32": [   +    "10.254.254.3/32": [   @@ -20 +28,3 @@   -            "aspath": "102",    +            "aspath": "102 103",    +            "bestpath": true,    +            "network": "10.254.254.3/32",    @@ -27,0 +38,3 @@   +            "origin": "IGP",    +            "path": "102 103",    +            "pathFrom": "external",    @@ -29 +42 @@   -            "prefix": "10.254.254.2",    +            "prefix": "10.254.254.3",    @@ -31 +44,2 @@   -            "valid": true   +            "valid": true,    +            "weight": 0   @@ -34 +48 @@   -    "10.254.254.3/32": [   +    "10.254.254.4/32": [   @@ -36 +50,5 @@   -            "aspath": "102 103",    +            "aspath": "",    +            "bestpath": true,    +            "med": 0,    +            "metric": 0,    +            "network": "10.254.254.4/32",    @@ -40 +58 @@   -                    "ip": "192.168.2.2",    +                    "ip": "0.0.0.0",    @@ -44,2 +62,5 @@   -            "peerId": "192.168.2.2",    -            "prefix": "10.254.254.3",    +            "origin": "IGP",    +            "path": "",    +            "pathFrom": "external",    +            "peerId": "(unspec)",    +            "prefix": "10.254.254.4",    @@ -47 +68,2 @@   -            "valid": true   +            "valid": true,    +            "weight": 32768
E   AssertionError: r4: bgp did not converge
    assert expected key(s) [u'10.254.254.1/32'] in json["routes"] (have [u'10.254.254.4/32', u'10.254.254.3/32', u'10.254.254.2/32']):
      --- Expected value
      +++ Current value
      @@ -2 +2 @@
      -    "10.254.254.1/32": [
      +    "10.254.254.2/32": [
(62 more lines...)
Collapse Failed test_lm-proxy-topo1 test_lm_proxy History
Topology Tests on Ubuntu 18.04 amd64 3 mins
AssertionError: wrong labels assert False
E   AssertionError: wrong labels
    assert False