FreeRangeRouting Github Pull Request Testing

Build: #6658 failed Custom build by Github Hook with revision master

Build result summary

Details

Completed
Duration
68 minutes
Flags
Custom revisionCustom build
Labels
version=frr-7_1-dev-185-g1c9269600git=https_//github_com/frrouting/frr_gitbuildurl=https_//ci1_netdef_org/browse/frr-frrpullreq-6658branch=master
Revision
master master
Total tests
5685
Fixed in
#6659 (Custom build by Github Hook with revision master)

Custom variables

Custom revision
master master
Name Value
github_base_sha 97c6009d49a9c122d8e70d85b5edae59a2cd4ebb
github_pullreq 3764
github_branch master
github_repo FRRouting/frr
github_merge_sha 1c9269600db8ce6091b8784f03c5074a30ac895f

Comments

  1. Github Hook

    GitHub Merge Request 3764
    for GitHub Repo FRRouting/frr, branch master

    Request to merge from donaldsharp/frr
    Merge Git Commit ID 1c9269600db8ce6091b8784f03c5074a30ac895f on top of base Git Commit ID 97c6009d49a9c122d8e70d85b5edae59a2cd4ebb

Code commits

Author Commit Message Commit date
Donald Sharp Donald Sharp 97c6009d49a9c122d8e70d85b5edae59a2cd4ebb 97c6009d49a9c122d8e70d85b5edae59a2cd4ebb Merge pull request #3760 from patrasar/RP_configure_inconsistent_addr_mask
pimd: reject inconsistent address/mask "ip pim rp command"

Tests

New test failures 3
Status Test View job Duration
Collapse Failed test_ospf_topo1_vrf test_memory_leak History
Topology Tests on Ubuntu 16.04 amd64 5 secs
AssertionError:  r1: zebra crashed. Core file found - Backtrace follows: [New LWP 12803] [Thread debugging using libthread_db enabled] Using host libthread_db library "/lib/x86_64-linux-gnu/libthread_db.so.1". Core was generated by `/usr/lib/frr/zebra --vrfwnetns'. Program terminated with signal SIGABRT, Aborted. #0  0x00007f89a5af2428 in __GI_raise (sig=sig@entry=6) at ../sysdeps/unix/sysv/linux/raise.c:54 #0  0x00007f89a5af2428 in __GI_raise (sig=sig@entry=6) at ../sysdeps/unix/sysv/linux/raise.c:54 #1  0x00007f89a5af402a in __GI_abort () at abort.c:89 #2  0x00007f89a651852a in core_handler (signo=11, siginfo=0x7ffc9ccc1d30, context=0x7ffc9ccc1c00) at lib/sigevent.c:249 #3  <signal handler called> #4  dplane_ctx_route_init (re=0x564442d4c930, rn=0x564442d4c6a0, op=DPLANE_OP_ROUTE_DELETE, ctx=0x564442d70d70) at zebra/zebra_dplane.c:946 #5  dplane_route_update_internal (rn=0x564442d4c6a0, re=0x564442d4c930, old_re=old_re@entry=0x0, op=op@entry=DPLANE_OP_ROUTE_DELETE) at zebra/zebra_dplane.c:1143 #6  0x000056444142bde5 in dplane_route_delete (rn=rn@entry=0x564442d4c6a0, re=re@entry=0x564442d4c930) at zebra/zebra_dplane.c:1239 #7  0x0000564441438502 in rib_uninstall_kernel (rn=rn@entry=0x564442d4c6a0, re=0x564442d4c930) at zebra/zebra_rib.c:1144 #8  0x000056444143bc30 in rib_close_table (table=<optimized out>) at zebra/zebra_rib.c:3232 #9  0x000056444143c2d1 in zebra_router_free_table (zrt=0x564442d4bd60) at zebra/zebra_router.c:167 #10 zebra_router_terminate () at zebra/zebra_router.c:188 #11 0x000056444141e458 in zebra_finalize (dummy=<optimized out>) at zebra/main.c:199 #12 0x00007f89a6525480 in thread_call (thread=thread@entry=0x7ffc9ccc24f0) at lib/thread.c:1606 #13 0x00007f89a64f90c8 in frr_run (master=0x564442beb5d0) at lib/libfrr.c:1011 #14 0x0000564441410419 in main (argc=2, argv=0x7ffc9ccc28d8) at zebra/main.c:473
E   AssertionError: 
    r1: zebra crashed. Core file found - Backtrace follows:
    [New LWP 12803]
    [Thread debugging using libthread_db enabled]
    Using host libthread_db library "/lib/x86_64-linux-gnu/libthread_db.so.1".
    Core was generated by `/usr/lib/frr/zebra --vrfwnetns'.
    Program terminated with signal SIGABRT, Aborted.
(16 more lines...)
Collapse Failed test_ospf_topo1_vrf test_memory_leak History
Topology Tests on Ubuntu 18.04 amd64 4 secs
AssertionError:  r1: zebra crashed. Core file found - Backtrace follows: [New LWP 18329] [Thread debugging using libthread_db enabled] Using host libthread_db library "/lib/x86_64-linux-gnu/libthread_db.so.1". Core was generated by `/usr/lib/frr/zebra --vrfwnetns'. Program terminated with signal SIGABRT, Aborted. #0  __GI_raise (sig=sig@entry=6) at ../sysdeps/unix/sysv/linux/raise.c:51 #0  __GI_raise (sig=sig@entry=6) at ../sysdeps/unix/sysv/linux/raise.c:51 #1  0x00007fcc3a11e801 in __GI_abort () at abort.c:79 #2  0x00007fcc3ab62bad in core_handler (signo=11, siginfo=0x7ffcbdf80d70, context=<optimized out>) at lib/sigevent.c:249 #3  <signal handler called> #4  dplane_ctx_route_init (re=0x558d3b3b8cb0, rn=0x558d3b3b8a20, op=DPLANE_OP_ROUTE_DELETE, ctx=0x558d3b521ef0) at zebra/zebra_dplane.c:946 #5  dplane_route_update_internal (rn=rn@entry=0x558d3b3b8a20, re=re@entry=0x558d3b3b8cb0, old_re=old_re@entry=0x0, op=op@entry=DPLANE_OP_ROUTE_DELETE) at zebra/zebra_dplane.c:1143 #6  0x0000558d398c55ab in dplane_route_delete (rn=rn@entry=0x558d3b3b8a20, re=re@entry=0x558d3b3b8cb0) at zebra/zebra_dplane.c:1239 #7  0x0000558d398d1b22 in rib_uninstall_kernel (rn=rn@entry=0x558d3b3b8a20, re=0x558d3b3b8cb0) at zebra/zebra_rib.c:1144 #8  0x0000558d398d533a in rib_close_table (table=<optimized out>) at zebra/zebra_rib.c:3232 #9  0x0000558d398d59f9 in zebra_router_free_table (zrt=0x558d3b3b80e0) at zebra/zebra_router.c:167 #10 zebra_router_terminate () at zebra/zebra_router.c:188 #11 0x0000558d398b81e8 in zebra_finalize (dummy=<optimized out>) at zebra/main.c:199 #12 0x00007fcc3ab6f9c6 in thread_call (thread=thread@entry=0x7ffcbdf81530) at lib/thread.c:1606 #13 0x00007fcc3ab43878 in frr_run (master=0x558d3b2552a0) at lib/libfrr.c:1011 #14 0x0000558d398aa029 in main (argc=2, argv=0x7ffcbdf81918) at zebra/main.c:473
E   AssertionError: 
    r1: zebra crashed. Core file found - Backtrace follows:
    [New LWP 18329]
    [Thread debugging using libthread_db enabled]
    Using host libthread_db library "/lib/x86_64-linux-gnu/libthread_db.so.1".
    Core was generated by `/usr/lib/frr/zebra --vrfwnetns'.
    Program terminated with signal SIGABRT, Aborted.
(16 more lines...)
Collapse Failed test_ospf_topo1_vrf test_memory_leak History
TopoTest Tests on Ubuntu 16.04 i386 3 secs
AssertionError:  r1: zebra crashed. Core file found - Backtrace follows: [New LWP 25622] [Thread debugging using libthread_db enabled] Using host libthread_db library "/lib/i386-linux-gnu/libthread_db.so.1". Core was generated by `/usr/lib/frr/zebra --vrfwnetns'. Program terminated with signal SIGABRT, Aborted. #0  0xb7f5dd05 in ?? () #0  0xb7f5dd05 in ?? () #1  <signal handler called> #2  dplane_ctx_route_init (re=<optimized out>, rn=<optimized out>, op=<optimized out>, ctx=<optimized out>) at zebra/zebra_dplane.c:946 #3  dplane_route_update_internal (rn=<optimized out>, re=<optimized out>, old_re=old_re@entry=0x0, op=DPLANE_OP_ROUTE_DELETE) at zebra/zebra_dplane.c:1143 #4  0x004d020f in dplane_route_delete (rn=<optimized out>, re=0x1b1b8f8) at zebra/zebra_dplane.c:1239 #5  0x004dd60d in rib_uninstall_kernel (rn=0x1b1af38, re=0x1b1b8f8) at zebra/zebra_rib.c:1144 #6  0x004e0ef2 in rib_close_table (table=0x1b1af90) at zebra/zebra_rib.c:3232 #7  0x004e163b in zebra_router_free_table (zrt=0x1b1b168) at zebra/zebra_router.c:167 #8  zebra_router_terminate () at zebra/zebra_router.c:188 #9  0x004c2304 in zebra_finalize (dummy=0xbf98a130) at zebra/main.c:199 #10 0xb7ef4759 in thread_call (thread=0xbf98a130) at lib/thread.c:1606 #11 0xb7ec6931 in frr_run (master=0x19abf70) at lib/libfrr.c:1011 #12 0x004b380b in main (argc=2, argv=0xbf98a474) at zebra/main.c:473
E   AssertionError: 
    r1: zebra crashed. Core file found - Backtrace follows:
    [New LWP 25622]
    [Thread debugging using libthread_db enabled]
    Using host libthread_db library "/lib/i386-linux-gnu/libthread_db.so.1".
    Core was generated by `/usr/lib/frr/zebra --vrfwnetns'.
    Program terminated with signal SIGABRT, Aborted.
(14 more lines...)