FreeRangeRouting Github Pull Request Testing

Build: #6669 failed Custom build by Github Hook with revision master

Logs

The following logs have been generated by the jobs in this plan.
  • Expand all
  • Collapse all
Job Logs
Collapse CentOS 6 amd64 build Building Stage Download or View
11-Feb-2019 04:47:24 make[2]: Leaving directory `/home/ci/cibuild.6669/frr-source'
11-Feb-2019 04:47:24 make[1]: Leaving directory `/home/ci/cibuild.6669/frr-source'
11-Feb-2019 04:47:24 pytest/DejaGNU Unittest on vm ci1006_centos6_amd64 with hostname ci1006.lab.netdef.org
11-Feb-2019 04:47:32 scp: cibuild.6669/frr-source/tests/*.xml: No such file or directory
11-Feb-2019 04:47:32 true
11-Feb-2019 04:47:32   CC       tests/lib/tests_lib_cxxcompat-cxxcompat.o
11-Feb-2019 04:47:32 In file included from tests/lib/cxxcompat.c:39:
11-Feb-2019 04:47:32 ./lib/frr_zmq.h:24:17: error: zmq.h: No such file or directory
11-Feb-2019 04:47:32 In file included from tests/lib/cxxcompat.c:39:
11-Feb-2019 04:47:32 ./lib/frr_zmq.h:44: error: expected declaration specifiers or ‘...’ before ‘zmq_msg_t’
11-Feb-2019 04:47:32 ./lib/frr_zmq.h:105: error: expected declaration specifiers or ‘...’ before ‘zmq_msg_t’
11-Feb-2019 04:47:32 cc1: warning: unrecognized command line option "-Wno-unused-result"
11-Feb-2019 04:47:32 make: *** [tests/lib/tests_lib_cxxcompat-cxxcompat.o] Error 1
11-Feb-2019 04:47:32 DejaGNU (Unittests) executed
11-Feb-2019 04:47:34 scp: cibuild.6669/frr-source/tests/*.sum: No such file or directory
11-Feb-2019 04:47:34 /usr/lib/ruby/2.3.0/rubygems/core_ext/kernel_require.rb:55:in `require': cannot load such file -- xml (LoadError)
11-Feb-2019 04:47:34         from /usr/lib/ruby/2.3.0/rubygems/core_ext/kernel_require.rb:55:in `require'
11-Feb-2019 04:47:34         from ci/bamboo-server/dejagnu.rb:3:in `<main>'
11-Feb-2019 04:47:38 Domain ci1006_centos6_amd64 is being shutdown
11-Feb-2019 04:47:38
11-Feb-2019 04:47:43 VM ci1006_centos6_amd64 is not yet shut off. Current State:          running
11-Feb-2019 04:47:43 -> sleeping 5s (35 attempts left to try again before failing)
11-Feb-2019 04:47:54 Unable to publish artifact [config.log]:
11-Feb-2019 04:47:54 Unable to publish artifact [CentOS 6 x86_64 RPMs]:
11-Feb-2019 04:47:54 The artifact is required for down stream Stages and Jobs, build will now fail.
Collapse CentOS 7 amd64 build Building Stage Download or View
11-Feb-2019 04:44:04 /usr/bin/install -c -m 644 doc/manpages/_build/man/zebra.8 doc/manpages/_build/man/watchfrr.8 doc/manpages/_build/man/bgpd.8 doc/manpages/_build/man/ripd.8 doc/manpages/_build/man/ripngd.8 doc/manpages/_build/man/ospfd.8 doc/manpages/_build/man/ospf6d.8 doc/manpages/_build/man/ospfclient.8 doc/manpages/_build/man/isisd.8 doc/manpages/_build/man/nhrpd.8 doc/manpages/_build/man/ldpd.8 doc/manpages/_build/man/eigrpd.8 doc/manpages/_build/man/pimd.8 doc/manpages/_build/man/mtracebis.8 doc/manpages/_build/man/pbrd.8 doc/manpages/_build/man/staticd.8 doc/manpages/_build/man/bfdd.8 '/home/ci/cibuild.6669/frr-source/usr_local/share/man/man8'
11-Feb-2019 04:44:04 make[2]: Leaving directory `/home/ci/cibuild.6669/frr-source'
11-Feb-2019 04:44:04 make[1]: Leaving directory `/home/ci/cibuild.6669/frr-source'
11-Feb-2019 04:44:04 pytest/DejaGNU Unittest on vm ci205_centos7_amd64 with hostname ci205.lab.netdef.org
11-Feb-2019 04:44:05 true
11-Feb-2019 04:44:05   CC       tests/lib/tests_lib_cxxcompat-cxxcompat.o
11-Feb-2019 04:44:06 In file included from tests/lib/cxxcompat.c:39:0:
11-Feb-2019 04:44:06 ./lib/frr_zmq.h:24:17: fatal error: zmq.h: No such file or directory
11-Feb-2019 04:44:06 #include <zmq.h>
11-Feb-2019 04:44:06                  ^
11-Feb-2019 04:44:06 compilation terminated.
11-Feb-2019 04:44:06 make: *** [tests/lib/tests_lib_cxxcompat-cxxcompat.o] Error 1
11-Feb-2019 04:44:06 scp: cibuild.6669/frr-source/tests/*.xml: No such file or directory
11-Feb-2019 04:44:06 DejaGNU (Unittests) executed
11-Feb-2019 04:44:07 scp: cibuild.6669/frr-source/tests/*.sum: No such file or directory
11-Feb-2019 04:44:07 /usr/lib/ruby/2.3.0/rubygems/core_ext/kernel_require.rb:55:in `require': cannot load such file -- xml (LoadError)
11-Feb-2019 04:44:07         from /usr/lib/ruby/2.3.0/rubygems/core_ext/kernel_require.rb:55:in `require'
11-Feb-2019 04:44:07         from ci/bamboo-server/dejagnu.rb:3:in `<main>'
11-Feb-2019 04:44:12 Domain ci205_centos7_amd64 is being shutdown
11-Feb-2019 04:44:12
11-Feb-2019 04:44:17 VM ci205_centos7_amd64 is not yet shut off. Current State:          running
11-Feb-2019 04:44:17 -> sleeping 5s (35 attempts left to try again before failing)
11-Feb-2019 04:44:25 Unable to publish artifact [config.log]:
11-Feb-2019 04:44:25 Unable to publish artifact [CentOS 7 x86_64 RPMs]:
11-Feb-2019 04:44:25 The artifact is required for down stream Stages and Jobs, build will now fail.
Collapse Debian 8 amd64 build Building Stage Download or View
11-Feb-2019 04:46:27 make[2]: Leaving directory '/home/ci/cibuild.6669/frr-source'
11-Feb-2019 04:46:27 make[1]: Leaving directory '/home/ci/cibuild.6669/frr-source'
11-Feb-2019 04:46:27 pytest/DejaGNU Unittest on vm ci008_debian8_amd64 with hostname ci008.lab.netdef.org
11-Feb-2019 04:46:28 true
11-Feb-2019 04:46:28   CC       tests/lib/tests_lib_cxxcompat-cxxcompat.o
11-Feb-2019 04:46:28 In file included from tests/lib/cxxcompat.c:39:0:
11-Feb-2019 04:46:28 ./lib/frr_zmq.h:24:17: fatal error: zmq.h: No such file or directory
11-Feb-2019 04:46:28 #include <zmq.h>
11-Feb-2019 04:46:28                  ^
11-Feb-2019 04:46:28 compilation terminated.
11-Feb-2019 04:46:28 Makefile:7860: recipe for target 'tests/lib/tests_lib_cxxcompat-cxxcompat.o' failed
11-Feb-2019 04:46:28 make: *** [tests/lib/tests_lib_cxxcompat-cxxcompat.o] Error 1
11-Feb-2019 04:46:28 scp: cibuild.6669/frr-source/tests/*.xml: No such file or directory
11-Feb-2019 04:46:28 DejaGNU (Unittests) executed
11-Feb-2019 04:46:29 scp: cibuild.6669/frr-source/tests/*.sum: No such file or directory
11-Feb-2019 04:46:29 /usr/lib/ruby/2.3.0/rubygems/core_ext/kernel_require.rb:55:in `require': cannot load such file -- xml (LoadError)
11-Feb-2019 04:46:29         from /usr/lib/ruby/2.3.0/rubygems/core_ext/kernel_require.rb:55:in `require'
11-Feb-2019 04:46:29         from ci/bamboo-server/dejagnu.rb:3:in `<main>'
11-Feb-2019 04:46:31 Domain ci008_debian8_amd64 is being shutdown
11-Feb-2019 04:46:31
11-Feb-2019 04:46:33 VM ci008_debian8_amd64 is not yet shut off. Current State:          running
11-Feb-2019 04:46:33 -> sleeping 5s (35 attempts left to try again before failing)
11-Feb-2019 04:46:40 Unable to publish artifact [Debian 8 (Jessie) x86_64 Packages]: the source directory /home/bamboo/bamboo/xml-data/build-dir/15826953/FRR-FRRPULLREQ-CI008BLD/pkg does not exist.
11-Feb-2019 04:46:40 The artifact is required for down stream Stages and Jobs, build will now fail.
11-Feb-2019 04:46:40 Unable to publish artifact [config.log]:
Collapse Debian 9 amd64 build Building Stage Download or View
11-Feb-2019 04:44:01 /bin/mkdir -p '/home/ci/cibuild.6669/frr-source/usr_local/share/man/man8'
11-Feb-2019 04:44:01 /usr/bin/install -c -m 644 doc/manpages/_build/man/zebra.8 doc/manpages/_build/man/watchfrr.8 doc/manpages/_build/man/bgpd.8 doc/manpages/_build/man/ripd.8 doc/manpages/_build/man/ripngd.8 doc/manpages/_build/man/ospfd.8 doc/manpages/_build/man/ospf6d.8 doc/manpages/_build/man/ospfclient.8 doc/manpages/_build/man/isisd.8 doc/manpages/_build/man/nhrpd.8 doc/manpages/_build/man/ldpd.8 doc/manpages/_build/man/eigrpd.8 doc/manpages/_build/man/pimd.8 doc/manpages/_build/man/mtracebis.8 doc/manpages/_build/man/pbrd.8 doc/manpages/_build/man/staticd.8 doc/manpages/_build/man/bfdd.8 '/home/ci/cibuild.6669/frr-source/usr_local/share/man/man8'
11-Feb-2019 04:44:01 make[2]: Leaving directory '/home/ci/cibuild.6669/frr-source'
11-Feb-2019 04:44:01 make[1]: Leaving directory '/home/ci/cibuild.6669/frr-source'
11-Feb-2019 04:44:01 pytest/DejaGNU Unittest on vm ci221_debian9_amd64 with hostname ci221.lab.netdef.org
11-Feb-2019 04:44:02 true
11-Feb-2019 04:44:02   CC       tests/lib/tests_lib_cxxcompat-cxxcompat.o
11-Feb-2019 04:44:02 In file included from tests/lib/cxxcompat.c:39:0:
11-Feb-2019 04:44:02 ./lib/frr_zmq.h:24:17: fatal error: zmq.h: No such file or directory
11-Feb-2019 04:44:02 #include <zmq.h>
11-Feb-2019 04:44:02                  ^
11-Feb-2019 04:44:02 compilation terminated.
11-Feb-2019 04:44:02 Makefile:7872: recipe for target 'tests/lib/tests_lib_cxxcompat-cxxcompat.o' failed
11-Feb-2019 04:44:02 make: *** [tests/lib/tests_lib_cxxcompat-cxxcompat.o] Error 1
11-Feb-2019 04:44:03 scp: cibuild.6669/frr-source/tests/*.xml: No such file or directory
11-Feb-2019 04:44:03 DejaGNU (Unittests) executed
11-Feb-2019 04:44:03 scp: cibuild.6669/frr-source/tests/*.sum: No such file or directory
11-Feb-2019 04:44:03 /usr/lib/ruby/2.3.0/rubygems/core_ext/kernel_require.rb:55:in `require': cannot load such file -- xml (LoadError)
11-Feb-2019 04:44:03         from /usr/lib/ruby/2.3.0/rubygems/core_ext/kernel_require.rb:55:in `require'
11-Feb-2019 04:44:03         from ci/bamboo-server/dejagnu.rb:3:in `<main>'
11-Feb-2019 04:44:07 Domain ci221_debian9_amd64 is being shutdown
11-Feb-2019 04:44:07
11-Feb-2019 04:44:12 Unable to publish artifact [Debian 9 (Stretch) x86_64 Packages]: the source directory /home/bamboo/bamboo/xml-data/build-dir/38010884/FRR-FRRPULLREQ-CI021BUILD/pkg does not exist.
11-Feb-2019 04:44:12 The artifact is required for down stream Stages and Jobs, build will now fail.
11-Feb-2019 04:44:12 Unable to publish artifact [config.log]:
Collapse FreeBSD 10 amd64 build Building Stage Download or View
11-Feb-2019 04:44:23                  from tests/lib/cxxcompat.c:20:
11-Feb-2019 04:44:23 /usr/include/netinet6/in6_var.h:330:9: note: struct defined here
11-Feb-2019 04:44:23   struct prf_ra {
11-Feb-2019 04:44:23          ^~~~~~
11-Feb-2019 04:44:23 /usr/include/netinet6/in6_var.h:330:9: note: struct defined here
11-Feb-2019 04:44:23 In file included from tests/lib/cxxcompat.c:39:0:
11-Feb-2019 04:44:23 ./lib/frr_zmq.h:24:10: fatal error: zmq.h: No such file or directory
11-Feb-2019 04:44:23 #include <zmq.h>
11-Feb-2019 04:44:23           ^~~~~~~
11-Feb-2019 04:44:23 compilation terminated.
11-Feb-2019 04:44:23 gmake: *** [Makefile:8304: tests/lib/cxxcompat-cxxcompat.o] Error 1
11-Feb-2019 04:44:23 scp: cibuild.6669/frr-source/tests/*.xml: No such file or directory
11-Feb-2019 04:44:23 DejaGNU (Unittests) executed
11-Feb-2019 04:44:23 scp: cibuild.6669/frr-source/tests/*.sum: No such file or directory
11-Feb-2019 04:44:24 /usr/lib/ruby/2.3.0/rubygems/core_ext/kernel_require.rb:55:in `require': cannot load such file -- xml (LoadError)
11-Feb-2019 04:44:24         from /usr/lib/ruby/2.3.0/rubygems/core_ext/kernel_require.rb:55:in `require'
11-Feb-2019 04:44:24         from ci/bamboo-server/dejagnu.rb:3:in `<main>'
11-Feb-2019 04:44:29 Domain ci103_freebsd10_amd64 is being shutdown
11-Feb-2019 04:44:29
11-Feb-2019 04:44:31 VM ci103_freebsd10_amd64 is not yet shut off. Current State:          running
11-Feb-2019 04:44:31 -> sleeping 5s (35 attempts left to try again before failing)
11-Feb-2019 04:44:39 VM ci103_freebsd10_amd64 is not yet shut off. Current State:          running
11-Feb-2019 04:44:39 -> sleeping 5s (34 attempts left to try again before failing)
11-Feb-2019 04:44:46 Unable to publish artifact [config.log]:
11-Feb-2019 04:44:46 Unable to publish artifact [FreeBSD 10 x86_64 Package]:
Collapse FreeBSD 11 amd64 build Building Stage Download or View
11-Feb-2019 04:44:53                  from ./lib/prefix.h:34,
11-Feb-2019 04:44:53                  from ./lib/agg_table.h:23,
11-Feb-2019 04:44:53                  from tests/lib/cxxcompat.c:20:
11-Feb-2019 04:44:53 /usr/include/netinet6/in6_var.h:319:9: note: struct defined here
11-Feb-2019 04:44:53   struct prf_ra {
11-Feb-2019 04:44:53          ^~~~~~
11-Feb-2019 04:44:53 /usr/include/netinet6/in6_var.h:319:9: note: struct defined here
11-Feb-2019 04:44:53 In file included from tests/lib/cxxcompat.c:39:0:
11-Feb-2019 04:44:53 ./lib/frr_zmq.h:24:10: fatal error: zmq.h: No such file or directory
11-Feb-2019 04:44:53 #include <zmq.h>
11-Feb-2019 04:44:53           ^~~~~~~
11-Feb-2019 04:44:53 compilation terminated.
11-Feb-2019 04:44:53 gmake: *** [Makefile:8304: tests/lib/cxxcompat-cxxcompat.o] Error 1
11-Feb-2019 04:44:53 scp: cibuild.6669/frr-source/tests/*.xml: No such file or directory
11-Feb-2019 04:44:53 DejaGNU (Unittests) executed
11-Feb-2019 04:44:53 scp: cibuild.6669/frr-source/tests/*.sum: No such file or directory
11-Feb-2019 04:44:53 /usr/lib/ruby/2.3.0/rubygems/core_ext/kernel_require.rb:55:in `require': cannot load such file -- xml (LoadError)
11-Feb-2019 04:44:53         from /usr/lib/ruby/2.3.0/rubygems/core_ext/kernel_require.rb:55:in `require'
11-Feb-2019 04:44:53         from ci/bamboo-server/dejagnu.rb:3:in `<main>'
11-Feb-2019 04:44:58 Domain ci219_freebsd11_amd64 is being shutdown
11-Feb-2019 04:44:58
11-Feb-2019 04:45:01 VM ci219_freebsd11_amd64 is not yet shut off. Current State:          running
11-Feb-2019 04:45:01 -> sleeping 5s (35 attempts left to try again before failing)
11-Feb-2019 04:45:11 Unable to publish artifact [config.log]:
11-Feb-2019 04:45:11 Unable to publish artifact [FreeBSD 11 x86_64 Package]:
Collapse NetBSD 6 amd64 build Building Stage Download or View
11-Feb-2019 04:45:50                  from tests/lib/cxxcompat.c:20:
11-Feb-2019 04:45:51 /usr/include/netinet/if_ether.h:74:2: error: expected specifier-qualifier-list before 'u_int8_t'
11-Feb-2019 04:45:51 In file included from ./lib/sockunion.h:25:0,
11-Feb-2019 04:45:51                  from ./lib/prefix.h:34,
11-Feb-2019 04:45:51                  from ./lib/agg_table.h:23,
11-Feb-2019 04:45:51                  from tests/lib/cxxcompat.c:20:
11-Feb-2019 04:45:51 ./lib/privs.h:70:2: error: expected specifier-qualifier-list before 'uid_t'
11-Feb-2019 04:45:51 In file included from tests/lib/cxxcompat.c:39:0:
11-Feb-2019 04:45:51 ./lib/frr_zmq.h:24:17: fatal error: zmq.h: No such file or directory
11-Feb-2019 04:45:51 compilation terminated.
11-Feb-2019 04:45:51 gmake: *** [Makefile:7871: tests/lib/tests_lib_cxxcompat-cxxcompat.o] Error 1
11-Feb-2019 04:45:51 scp: cibuild.6669/frr-source/tests/*.xml: No such file or directory
11-Feb-2019 04:45:51 DejaGNU (Unittests) executed
11-Feb-2019 04:45:51 scp: cibuild.6669/frr-source/tests/*.sum: No such file or directory
11-Feb-2019 04:45:51 /usr/lib/ruby/2.3.0/rubygems/core_ext/kernel_require.rb:55:in `require': cannot load such file -- xml (LoadError)
11-Feb-2019 04:45:51         from /usr/lib/ruby/2.3.0/rubygems/core_ext/kernel_require.rb:55:in `require'
11-Feb-2019 04:45:51         from ci/bamboo-server/dejagnu.rb:3:in `<main>'
11-Feb-2019 04:45:53 Domain ci007_netbsd6_amd64 is being shutdown
11-Feb-2019 04:45:53
11-Feb-2019 04:45:56 VM ci007_netbsd6_amd64 is not yet shut off. Current State:          running
11-Feb-2019 04:45:56 -> sleeping 5s (35 attempts left to try again before failing)
11-Feb-2019 04:46:03 VM ci007_netbsd6_amd64 is not yet shut off. Current State:          running
11-Feb-2019 04:46:03 -> sleeping 5s (34 attempts left to try again before failing)
11-Feb-2019 04:46:10 Unable to publish artifact [config.log]:
11-Feb-2019 04:46:10 Unable to publish artifact [NetBSD 6 x86_64 Package]:
Collapse NetBSD 7 amd64 build Building Stage Download or View
11-Feb-2019 04:44:23 gmake[2]: Leaving directory '/home/ci/cibuild.6669/frr-source'
11-Feb-2019 04:44:23 gmake[1]: Leaving directory '/home/ci/cibuild.6669/frr-source'
11-Feb-2019 04:44:23 pytest/DejaGNU Unittest on vm ci112_netbsd7_amd64 with hostname ci112.lab.netdef.org
11-Feb-2019 04:44:24 true
11-Feb-2019 04:44:24   CC       tests/lib/tests_lib_cxxcompat-cxxcompat.o
11-Feb-2019 04:44:24 In file included from tests/lib/cxxcompat.c:39:0:
11-Feb-2019 04:44:24 ./lib/frr_zmq.h:24:17: fatal error: zmq.h: No such file or directory
11-Feb-2019 04:44:24 #include <zmq.h>
11-Feb-2019 04:44:24                  ^
11-Feb-2019 04:44:24 compilation terminated.
11-Feb-2019 04:44:24 gmake: *** [Makefile:7871: tests/lib/tests_lib_cxxcompat-cxxcompat.o] Error 1
11-Feb-2019 04:44:24 scp: cibuild.6669/frr-source/tests/*.xml: No such file or directory
11-Feb-2019 04:44:24 DejaGNU (Unittests) executed
11-Feb-2019 04:44:25 scp: cibuild.6669/frr-source/tests/*.sum: No such file or directory
11-Feb-2019 04:44:25 /usr/lib/ruby/2.3.0/rubygems/core_ext/kernel_require.rb:55:in `require': cannot load such file -- xml (LoadError)
11-Feb-2019 04:44:25         from /usr/lib/ruby/2.3.0/rubygems/core_ext/kernel_require.rb:55:in `require'
11-Feb-2019 04:44:25         from ci/bamboo-server/dejagnu.rb:3:in `<main>'
11-Feb-2019 04:44:29 Domain ci112_netbsd7_amd64 is being shutdown
11-Feb-2019 04:44:29
11-Feb-2019 04:44:31 VM ci112_netbsd7_amd64 is not yet shut off. Current State:          running
11-Feb-2019 04:44:31 -> sleeping 5s (35 attempts left to try again before failing)
11-Feb-2019 04:44:39 VM ci112_netbsd7_amd64 is not yet shut off. Current State:          running
11-Feb-2019 04:44:39 -> sleeping 5s (34 attempts left to try again before failing)
11-Feb-2019 04:44:46 Unable to publish artifact [config.log]:
11-Feb-2019 04:44:46 Unable to publish artifact [NetBSD 7 x86_64 Package]:
Collapse OpenBSD 6 amd64 build Building Stage Download or View
11-Feb-2019 04:45:19                  from tests/lib/cxxcompat.c:20:
11-Feb-2019 04:45:19 ./lib/privs.h:27: error: expected '=', ',', ';', 'asm' or '__attribute__' before 'typedef'
11-Feb-2019 04:45:19 ./lib/privs.h:54: error: expected specifier-qualifier-list before 'zebra_capabilities_t'
11-Feb-2019 04:45:19 ./lib/privs.h:70: error: expected specifier-qualifier-list before 'uid_t'
11-Feb-2019 04:45:19 In file included from tests/lib/cxxcompat.c:39:
11-Feb-2019 04:45:19 ./lib/frr_zmq.h:24:17: error: zmq.h: No such file or directory
11-Feb-2019 04:45:19 In file included from tests/lib/cxxcompat.c:39:
11-Feb-2019 04:45:19 ./lib/frr_zmq.h:44: error: expected declaration specifiers or '...' before 'zmq_msg_t'
11-Feb-2019 04:45:19 ./lib/frr_zmq.h:105: error: expected declaration specifiers or '...' before 'zmq_msg_t'
11-Feb-2019 04:45:19 cc1: error: unrecognized command line option "-Wno-unused-result"
11-Feb-2019 04:45:19 gmake: *** [Makefile:7870: tests/lib/tests_lib_cxxcompat-cxxcompat.o] Error 1
11-Feb-2019 04:45:19 scp: cibuild.6669/frr-source/tests/*.xml: No such file or directory
11-Feb-2019 04:45:19 DejaGNU (Unittests) executed
11-Feb-2019 04:45:19 scp: cibuild.6669/frr-source/tests/*.sum: No such file or directory
11-Feb-2019 04:45:20 /usr/lib/ruby/2.3.0/rubygems/core_ext/kernel_require.rb:55:in `require': cannot load such file -- xml (LoadError)
11-Feb-2019 04:45:20         from /usr/lib/ruby/2.3.0/rubygems/core_ext/kernel_require.rb:55:in `require'
11-Feb-2019 04:45:20         from ci/bamboo-server/dejagnu.rb:3:in `<main>'
11-Feb-2019 04:45:22 Domain ci020_openbsd60_amd64 is being shutdown
11-Feb-2019 04:45:22
11-Feb-2019 04:45:24 VM ci020_openbsd60_amd64 is not yet shut off. Current State:          running
11-Feb-2019 04:45:24 -> sleeping 5s (35 attempts left to try again before failing)
11-Feb-2019 04:45:31 VM ci020_openbsd60_amd64 is not yet shut off. Current State:          running
11-Feb-2019 04:45:31 -> sleeping 5s (34 attempts left to try again before failing)
11-Feb-2019 04:45:39 Unable to publish artifact [config.log]:
11-Feb-2019 04:45:39 Unable to publish artifact [OpenBSD 6.0 x86_64 Package]:
Collapse Ubuntu 14.04 amd64 build Building Stage Download or View
11-Feb-2019 04:44:47 /usr/bin/install -c -m 644 doc/manpages/_build/man/frr.1 doc/manpages/_build/man/vtysh.1 '/home/ci/cibuild.6669/frr-source/usr_local/share/man/man1'
11-Feb-2019 04:44:47 /bin/mkdir -p '/home/ci/cibuild.6669/frr-source/usr_local/share/man/man8'
11-Feb-2019 04:44:47 /usr/bin/install -c -m 644 doc/manpages/_build/man/zebra.8 doc/manpages/_build/man/watchfrr.8 doc/manpages/_build/man/bgpd.8 doc/manpages/_build/man/ripd.8 doc/manpages/_build/man/ripngd.8 doc/manpages/_build/man/ospfd.8 doc/manpages/_build/man/ospf6d.8 doc/manpages/_build/man/ospfclient.8 doc/manpages/_build/man/isisd.8 doc/manpages/_build/man/nhrpd.8 doc/manpages/_build/man/ldpd.8 doc/manpages/_build/man/eigrpd.8 doc/manpages/_build/man/pimd.8 doc/manpages/_build/man/mtracebis.8 doc/manpages/_build/man/pbrd.8 doc/manpages/_build/man/staticd.8 doc/manpages/_build/man/bfdd.8 '/home/ci/cibuild.6669/frr-source/usr_local/share/man/man8'
11-Feb-2019 04:44:47 make[2]: Leaving directory `/home/ci/cibuild.6669/frr-source'
11-Feb-2019 04:44:47 make[1]: Leaving directory `/home/ci/cibuild.6669/frr-source'
11-Feb-2019 04:44:47 pytest/DejaGNU Unittest on vm ci101_ubuntu1404_amd64 with hostname ci101.lab.netdef.org
11-Feb-2019 04:44:49 true
11-Feb-2019 04:44:49   CC       tests/lib/tests_lib_cxxcompat-cxxcompat.o
11-Feb-2019 04:44:49 In file included from tests/lib/cxxcompat.c:39:0:
11-Feb-2019 04:44:49 ./lib/frr_zmq.h:24:17: fatal error: zmq.h: No such file or directory
11-Feb-2019 04:44:49 #include <zmq.h>
11-Feb-2019 04:44:49                  ^
11-Feb-2019 04:44:49 compilation terminated.
11-Feb-2019 04:44:49 make: *** [tests/lib/tests_lib_cxxcompat-cxxcompat.o] Error 1
11-Feb-2019 04:44:49 scp: cibuild.6669/frr-source/tests/*.xml: No such file or directory
11-Feb-2019 04:44:49 DejaGNU (Unittests) executed
11-Feb-2019 04:44:49 scp: cibuild.6669/frr-source/tests/*.sum: No such file or directory
11-Feb-2019 04:44:50 /usr/lib/ruby/2.3.0/rubygems/core_ext/kernel_require.rb:55:in `require': cannot load such file -- xml (LoadError)
11-Feb-2019 04:44:50         from /usr/lib/ruby/2.3.0/rubygems/core_ext/kernel_require.rb:55:in `require'
11-Feb-2019 04:44:50         from ci/bamboo-server/dejagnu.rb:3:in `<main>'
11-Feb-2019 04:44:52 Domain ci101_ubuntu1404_amd64 is being shutdown
11-Feb-2019 04:44:52
11-Feb-2019 04:44:55 Unable to publish artifact [config.log]:
11-Feb-2019 04:44:56 Unable to publish artifact [Ubuntu 14.04 x86_64 Packages]: the source directory /home/bamboo/bamboo/xml-data/build-dir/30441512/FRR-FRRPULLREQ-CI001BUILD/pkg does not exist.
11-Feb-2019 04:44:56 The artifact is required for down stream Stages and Jobs, build will now fail.
Collapse Ubuntu 16.04 amd64 build Building Stage Download or View
11-Feb-2019 04:44:56 /bin/mkdir -p '/home/ci/cibuild.6669/frr-source/usr_local/share/man/man8'
11-Feb-2019 04:44:56 /usr/bin/install -c -m 644 doc/manpages/_build/man/zebra.8 doc/manpages/_build/man/watchfrr.8 doc/manpages/_build/man/bgpd.8 doc/manpages/_build/man/ripd.8 doc/manpages/_build/man/ripngd.8 doc/manpages/_build/man/ospfd.8 doc/manpages/_build/man/ospf6d.8 doc/manpages/_build/man/ospfclient.8 doc/manpages/_build/man/isisd.8 doc/manpages/_build/man/nhrpd.8 doc/manpages/_build/man/ldpd.8 doc/manpages/_build/man/eigrpd.8 doc/manpages/_build/man/pimd.8 doc/manpages/_build/man/mtracebis.8 doc/manpages/_build/man/pbrd.8 doc/manpages/_build/man/staticd.8 doc/manpages/_build/man/bfdd.8 '/home/ci/cibuild.6669/frr-source/usr_local/share/man/man8'
11-Feb-2019 04:44:56 make[2]: Leaving directory '/home/ci/cibuild.6669/frr-source'
11-Feb-2019 04:44:56 make[1]: Leaving directory '/home/ci/cibuild.6669/frr-source'
11-Feb-2019 04:44:56 pytest/DejaGNU Unittest on vm ci214_ubuntu1604_amd64 with hostname ci214.lab.netdef.org
11-Feb-2019 04:44:57 true
11-Feb-2019 04:44:57   CC       tests/lib/tests_lib_cxxcompat-cxxcompat.o
11-Feb-2019 04:44:57 In file included from tests/lib/cxxcompat.c:39:0:
11-Feb-2019 04:44:57 ./lib/frr_zmq.h:24:17: fatal error: zmq.h: No such file or directory
11-Feb-2019 04:44:57 compilation terminated.
11-Feb-2019 04:44:57 Makefile:7872: recipe for target 'tests/lib/tests_lib_cxxcompat-cxxcompat.o' failed
11-Feb-2019 04:44:57 make: *** [tests/lib/tests_lib_cxxcompat-cxxcompat.o] Error 1
11-Feb-2019 04:44:58 scp: cibuild.6669/frr-source/tests/*.xml: No such file or directory
11-Feb-2019 04:44:58 DejaGNU (Unittests) executed
11-Feb-2019 04:44:58 scp: cibuild.6669/frr-source/tests/*.sum: No such file or directory
11-Feb-2019 04:44:58 /usr/lib/ruby/2.3.0/rubygems/core_ext/kernel_require.rb:55:in `require': cannot load such file -- xml (LoadError)
11-Feb-2019 04:44:58         from /usr/lib/ruby/2.3.0/rubygems/core_ext/kernel_require.rb:55:in `require'
11-Feb-2019 04:44:58         from ci/bamboo-server/dejagnu.rb:3:in `<main>'
11-Feb-2019 04:45:03 Domain ci214_ubuntu1604_amd64 is being shutdown
11-Feb-2019 04:45:03
11-Feb-2019 04:45:07 Unable to publish artifact [config.log]:
11-Feb-2019 04:45:07 Unable to publish artifact [Ubuntu 16.04 x86_64 Packages]: the source directory /home/bamboo/bamboo/xml-data/build-dir/30441536/FRR-FRRPULLREQ-CI014BUILD/pkg does not exist.
11-Feb-2019 04:45:07 The artifact is required for down stream Stages and Jobs, build will now fail.
11-Feb-2019 04:45:07 Unable to publish artifact [Ubuntu 16.04 x86_64 Snap Package]: the source directory /home/bamboo/bamboo/xml-data/build-dir/30441536/FRR-FRRPULLREQ-CI014BUILD/snap does not exist.
11-Feb-2019 04:45:07 The artifact is required for down stream Stages and Jobs, build will now fail.
Collapse Ubuntu 16.04 i386 build Building Stage Download or View
11-Feb-2019 04:45:05 /usr/bin/install -c -m 644 doc/manpages/_build/man/frr.1 doc/manpages/_build/man/vtysh.1 '/home/ci/cibuild.6669/frr-source/usr_local/share/man/man1'
11-Feb-2019 04:45:06 /bin/mkdir -p '/home/ci/cibuild.6669/frr-source/usr_local/share/man/man8'
11-Feb-2019 04:45:06 /usr/bin/install -c -m 644 doc/manpages/_build/man/zebra.8 doc/manpages/_build/man/watchfrr.8 doc/manpages/_build/man/bgpd.8 doc/manpages/_build/man/ripd.8 doc/manpages/_build/man/ripngd.8 doc/manpages/_build/man/ospfd.8 doc/manpages/_build/man/ospf6d.8 doc/manpages/_build/man/ospfclient.8 doc/manpages/_build/man/isisd.8 doc/manpages/_build/man/nhrpd.8 doc/manpages/_build/man/ldpd.8 doc/manpages/_build/man/eigrpd.8 doc/manpages/_build/man/pimd.8 doc/manpages/_build/man/mtracebis.8 doc/manpages/_build/man/pbrd.8 doc/manpages/_build/man/staticd.8 doc/manpages/_build/man/bfdd.8 '/home/ci/cibuild.6669/frr-source/usr_local/share/man/man8'
11-Feb-2019 04:45:06 make[2]: Leaving directory '/home/ci/cibuild.6669/frr-source'
11-Feb-2019 04:45:06 make[1]: Leaving directory '/home/ci/cibuild.6669/frr-source'
11-Feb-2019 04:45:06 pytest/DejaGNU Unittest on vm ci209_ubuntu1604_i386 with hostname ci209.lab.netdef.org
11-Feb-2019 04:45:07 true
11-Feb-2019 04:45:07   CC       tests/lib/tests_lib_cxxcompat-cxxcompat.o
11-Feb-2019 04:45:07 In file included from tests/lib/cxxcompat.c:39:0:
11-Feb-2019 04:45:07 ./lib/frr_zmq.h:24:17: fatal error: zmq.h: No such file or directory
11-Feb-2019 04:45:07 compilation terminated.
11-Feb-2019 04:45:07 Makefile:7872: recipe for target 'tests/lib/tests_lib_cxxcompat-cxxcompat.o' failed
11-Feb-2019 04:45:07 make: *** [tests/lib/tests_lib_cxxcompat-cxxcompat.o] Error 1
11-Feb-2019 04:45:08 scp: cibuild.6669/frr-source/tests/*.xml: No such file or directory
11-Feb-2019 04:45:08 DejaGNU (Unittests) executed
11-Feb-2019 04:45:08 scp: cibuild.6669/frr-source/tests/*.sum: No such file or directory
11-Feb-2019 04:45:08 /usr/lib/ruby/2.3.0/rubygems/core_ext/kernel_require.rb:55:in `require': cannot load such file -- xml (LoadError)
11-Feb-2019 04:45:08         from /usr/lib/ruby/2.3.0/rubygems/core_ext/kernel_require.rb:55:in `require'
11-Feb-2019 04:45:08         from ci/bamboo-server/dejagnu.rb:3:in `<main>'
11-Feb-2019 04:45:11 Domain ci209_ubuntu1604_i386 is being shutdown
11-Feb-2019 04:45:11
11-Feb-2019 04:45:15 Unable to publish artifact [config.log]:
11-Feb-2019 04:45:15 Unable to publish artifact [Ubuntu 16.04 i386 Packages]: the source directory /home/bamboo/bamboo/xml-data/build-dir/34045985/FRR-FRRPULLREQ-U1604I386/pkg does not exist.
11-Feb-2019 04:45:15 The artifact is required for down stream Stages and Jobs, build will now fail.
11-Feb-2019 04:45:15 Unable to publish artifact [Ubuntu 16.04 i386 Snap Package]: the source directory /home/bamboo/bamboo/xml-data/build-dir/34045985/FRR-FRRPULLREQ-U1604I386/snap does not exist.
Collapse Ubuntu 18.04 amd64 build Building Stage Download or View
11-Feb-2019 04:44:46 /usr/bin/install -c -m 644 doc/manpages/_build/man/zebra.8 doc/manpages/_build/man/watchfrr.8 doc/manpages/_build/man/bgpd.8 doc/manpages/_build/man/ripd.8 doc/manpages/_build/man/ripngd.8 doc/manpages/_build/man/ospfd.8 doc/manpages/_build/man/ospf6d.8 doc/manpages/_build/man/ospfclient.8 doc/manpages/_build/man/isisd.8 doc/manpages/_build/man/nhrpd.8 doc/manpages/_build/man/ldpd.8 doc/manpages/_build/man/eigrpd.8 doc/manpages/_build/man/pimd.8 doc/manpages/_build/man/mtracebis.8 doc/manpages/_build/man/pbrd.8 doc/manpages/_build/man/staticd.8 doc/manpages/_build/man/bfdd.8 '/home/ci/cibuild.6669/frr-source/usr_local/share/man/man8'
11-Feb-2019 04:44:46 make[2]: Leaving directory '/home/ci/cibuild.6669/frr-source'
11-Feb-2019 04:44:46 make[1]: Leaving directory '/home/ci/cibuild.6669/frr-source'
11-Feb-2019 04:44:46 pytest/DejaGNU Unittest on vm ci122_ubuntu1804_amd64 with hostname ci122.lab.netdef.org
11-Feb-2019 04:44:47 true
11-Feb-2019 04:44:47   CC       tests/lib/tests_lib_cxxcompat-cxxcompat.o
11-Feb-2019 04:44:48 In file included from tests/lib/cxxcompat.c:39:0:
11-Feb-2019 04:44:48 ./lib/frr_zmq.h:24:10: fatal error: zmq.h: No such file or directory
11-Feb-2019 04:44:48 #include <zmq.h>
11-Feb-2019 04:44:48           ^~~~~~~
11-Feb-2019 04:44:48 compilation terminated.
11-Feb-2019 04:44:48 Makefile:7872: recipe for target 'tests/lib/tests_lib_cxxcompat-cxxcompat.o' failed
11-Feb-2019 04:44:48 make: *** [tests/lib/tests_lib_cxxcompat-cxxcompat.o] Error 1
11-Feb-2019 04:44:48 scp: cibuild.6669/frr-source/tests/*.xml: No such file or directory
11-Feb-2019 04:44:48 DejaGNU (Unittests) executed
11-Feb-2019 04:44:48 scp: cibuild.6669/frr-source/tests/*.sum: No such file or directory
11-Feb-2019 04:44:49 /usr/lib/ruby/2.3.0/rubygems/core_ext/kernel_require.rb:55:in `require': cannot load such file -- xml (LoadError)
11-Feb-2019 04:44:49         from /usr/lib/ruby/2.3.0/rubygems/core_ext/kernel_require.rb:55:in `require'
11-Feb-2019 04:44:49         from ci/bamboo-server/dejagnu.rb:3:in `<main>'
11-Feb-2019 04:44:52 Domain ci122_ubuntu1804_amd64 is being shutdown
11-Feb-2019 04:44:52
11-Feb-2019 04:44:55 Unable to publish artifact [config.log]:
11-Feb-2019 04:44:55 Unable to publish artifact [Ubuntu 18.04 x86_64 Packages]: the source directory /home/bamboo/bamboo/xml-data/build-dir/46432262/FRR-FRRPULLREQ-U1804AMD64/pkg does not exist.
11-Feb-2019 04:44:55 The artifact is required for down stream Stages and Jobs, build will now fail.
11-Feb-2019 04:44:55 Unable to publish artifact [Ubuntu 18.04 x86_64 Snap Package]: the source directory /home/bamboo/bamboo/xml-data/build-dir/46432262/FRR-FRRPULLREQ-U1804AMD64/snap does not exist.