FreeRangeRouting Github Pull Request Testing

Build: #6678 failed Custom build by Github Hook with revision master

Build result summary

Details

Completed
Duration
88 minutes
Flags
Custom revisionCustom build
Labels
version=frr-7_1-dev-189-g037dfdac2git=https_//github_com/frrouting/frr_gitbuildurl=https_//ci1_netdef_org/browse/frr-frrpullreq-6678branch=master
Revision
master master
Total tests
5685
Fixed in
#6679 (Custom build by Github Hook with revision master)

Tests

Custom variables

Custom revision
master master
Name Value
github_base_sha fb85ce1b812d892a07a4f942b4cfade9442b9a2b
github_pullreq 3775
github_branch master
github_repo FRRouting/frr
github_merge_sha 037dfdac2f283ca0741a5edd24f29d710a5b2040

Comments

  1. Github Hook

    GitHub Merge Request 3775
    for GitHub Repo FRRouting/frr, branch master

    Request to merge from pguibert6WIND/frr
    Merge Git Commit ID 037dfdac2f283ca0741a5edd24f29d710a5b2040 on top of base Git Commit ID fb85ce1b812d892a07a4f942b4cfade9442b9a2b

Code commits

Author Commit Message Commit date
David Lamparter David Lamparter fb85ce1b812d892a07a4f942b4cfade9442b9a2b fb85ce1b812d892a07a4f942b4cfade9442b9a2b Merge pull request #3770 from donaldsharp/detailed_debugs
zebra: Update zserv debug messages to give a bit more useful info

Tests

New test failures 7
Status Test View job Duration
Collapse Failed test_bgp_l3vpn_to_bgp_vrf test_memory_leak History
Topology Tests on Ubuntu 16.04 amd64 28 secs
AssertionError: r4: Daemon zebra not running r1: Daemon zebra not running r3: Daemon zebra not running ce4: Daemon zebra not running
E   AssertionError: r4: Daemon zebra not running
    r1: Daemon zebra not running
    r3: Daemon zebra not running
    ce4: Daemon zebra not running
Collapse Failed test_bgp_l3vpn_to_bgp_vrf test_adjacencies History
Topology Tests on Ubuntu 16.04 amd64 14 mins
AssertionError: 17 tests failed
E   AssertionError: 17 tests failed
Collapse Failed test_bgp_l3vpn_to_bgp_vrf test_check_linux_vrf History
Topology Tests on Ubuntu 18.04 amd64 1 min
AssertionError: 13 tests failed
E   AssertionError: 13 tests failed
Collapse Failed test_bgp_l3vpn_to_bgp_vrf test_memory_leak History
Topology Tests on Ubuntu 18.04 amd64 5 secs
AssertionError: r4: Daemon zebra not running r1: Daemon zebra not running r3: Daemon zebra not running ce4: Daemon zebra not running
E   AssertionError: r4: Daemon zebra not running
    r1: Daemon zebra not running
    r3: Daemon zebra not running
    ce4: Daemon zebra not running
Collapse Failed test_bgp_l3vpn_to_bgp_vrf test_memory_leak History
TopoTest Tests on Ubuntu 16.04 i386 3 secs
AssertionError: r4: Daemon zebra not running r1: Daemon zebra not running r3: Daemon zebra not running ce4: Daemon zebra not running
E   AssertionError: r4: Daemon zebra not running
    r1: Daemon zebra not running
    r3: Daemon zebra not running
    ce4: Daemon zebra not running
Collapse Failed test_bgp_l3vpn_to_bgp_vrf test_adjacencies History
TopoTest Tests on Ubuntu 16.04 i386 14 mins
AssertionError: 17 tests failed
E   AssertionError: 17 tests failed
Collapse Failed test_lm-proxy-topo1 test_lm_proxy History
Topology Tests on Ubuntu 18.04 amd64 14 secs
AssertionError: pe1: Daemon zebra not running pe2: Daemon zebra not running
E   AssertionError: pe1: Daemon zebra not running
    pe2: Daemon zebra not running