FreeRangeRouting Github Pull Request Testing

Build: #6923 failed Custom build by Github Hook with revision master

Build result summary

Details

Completed
Duration
64 minutes
Flags
Custom revisionCustom build
Labels
version=frr-7_1-dev-505-gaa6bb0e78git=https_//github_com/frrouting/frr_gitbuildurl=https_//ci1_netdef_org/browse/frr-frrpullreq-6923branch=master
Revision
master master
Total tests
5688
Fixed in
#6925 (Custom build by Github Hook with revision stable/7.0)

Tests

Custom variables

Custom revision
master master
Name Value
github_base_sha 6ac9718a2af66a796bf953e4ab9e7dd48f57754e
github_pullreq 3786
github_branch master
github_repo FRRouting/frr
github_merge_sha aa6bb0e78b4ae97df2bf0048b0c81d111a0d1e26

Comments

  1. Github Hook

    GitHub Merge Request 3786
    for GitHub Repo FRRouting/frr, branch master

    Request to merge from mjstapp/frr
    Merge Git Commit ID aa6bb0e78b4ae97df2bf0048b0c81d111a0d1e26 on top of base Git Commit ID 6ac9718a2af66a796bf953e4ab9e7dd48f57754e

Code commits

Author Commit Message Commit date
Donald Sharp Donald Sharp 6ac9718a2af66a796bf953e4ab9e7dd48f57754e 6ac9718a2af66a796bf953e4ab9e7dd48f57754e Merge pull request #3893 from mjstapp/dplane_pw_nexthops
zebra: include nexthop info when installing pseudowires

Tests

New test failures 8
Status Test View job Duration
Collapse Failed test_bgp_l3vpn_to_bgp_direct test_adjacencies History
TopoTest Tests on Ubuntu 16.04 i386 1 min
AssertionError: 2 tests failed
E   AssertionError: 2 tests failed
Collapse Failed test_bgp test_vrf_route_leak History
Topology Tests on Ubuntu 16.04 amd64 2 secs
KeyError: '10.0.0.0/24'
E   KeyError: '10.0.0.0/24'
Collapse Failed test_bgp test_vrf_route_leak History
TopoTest Tests on Ubuntu 16.04 i386 2 secs
KeyError: '10.0.1.0/24'
E   KeyError: '10.0.1.0/24'
Collapse Failed test_ospf_topo1_vrf test_ospf_kernel_route History
TopoTest Tests on Ubuntu 16.04 i386 1 min
AssertionError: OSPF IPv4 route mismatch in router "r1": --- Current output   +++ Expected output   @@ -1,6 +1,7 @@    VRF r1-cust1:    O   10.0.1.0/24 [110/10] is directly connected, r1-eth0, XX:XX:XX    C>* 10.0.1.0/24 is directly connected, r1-eth0, XX:XX:XX   +O>* 10.0.2.0/24 [110/20] via 10.0.3.3, r1-eth1, XX:XX:XX    O   10.0.3.0/24 [110/10] is directly connected, r1-eth1, XX:XX:XX    C>* 10.0.3.0/24 is directly connected, r1-eth1, XX:XX:XX    O>* 10.0.10.0/24 [110/20] via 10.0.3.1, r1-eth1, XX:XX:XX assert False
E   AssertionError: OSPF IPv4 route mismatch in router "r1": --- Current output
      +++ Expected output
      @@ -1,6 +1,7 @@
       VRF r1-cust1:
       O   10.0.1.0/24 [110/10] is directly connected, r1-eth0, XX:XX:XX
       C>* 10.0.1.0/24 is directly connected, r1-eth0, XX:XX:XX
      +O>* 10.0.2.0/24 [110/20] via 10.0.3.3, r1-eth1, XX:XX:XX
(4 more lines...)
Collapse Failed test_ospf_topo1_vrf test_ospf_convergence History
TopoTest Tests on Ubuntu 16.04 i386 1 min
AssertionError: OSPF did not converge on r1:   --- Current output   +++ Expected output   @@ -2,12 +2,16 @@    ============ OSPF network routing table ============    N 10.0.1.0/24 [10] area: 0.0.0.0     directly attached to r1-eth0   +N 10.0.2.0/24 [20] area: 0.0.0.0   + via 10.0.3.3, r1-eth1    N 10.0.3.0/24 [10] area: 0.0.0.0     directly attached to r1-eth1    N 10.0.10.0/24 [20] area: 0.0.0.0     via 10.0.3.1, r1-eth1        ============ OSPF router routing table =============   +R 10.0.255.2 [10] area: 0.0.0.0, ASBR   + via 10.0.3.3, r1-eth1    R 10.0.255.3 [10] area: 0.0.0.0, ASBR     via 10.0.3.1, r1-eth1     assert False
E   AssertionError: OSPF did not converge on r1:
      --- Current output
      +++ Expected output
      @@ -2,12 +2,16 @@
       ============ OSPF network routing table ============
       N 10.0.1.0/24 [10] area: 0.0.0.0
        directly attached to r1-eth0
(14 more lines...)
Collapse Failed test_ospf_topo1_vrf test_ospf_link_down_kernel_route History
TopoTest Tests on Ubuntu 16.04 i386 1 min
AssertionError: OSPF IPv4 route mismatch in router "r1" after link down: --- Current output   +++ Expected output   @@ -1,5 +1,6 @@    VRF r1-cust1:    O   10.0.1.0/24 [110/10] is directly connected, r1-eth0, XX:XX:XX    C>* 10.0.1.0/24 is directly connected, r1-eth0, XX:XX:XX   +O>* 10.0.2.0/24 [110/20] via 10.0.3.3, r1-eth1, XX:XX:XX    O   10.0.3.0/24 [110/10] is directly connected, r1-eth1, XX:XX:XX    C>* 10.0.3.0/24 is directly connected, r1-eth1, XX:XX:XX assert False
E   AssertionError: OSPF IPv4 route mismatch in router "r1" after link down: --- Current output
      +++ Expected output
      @@ -1,5 +1,6 @@
       VRF r1-cust1:
       O   10.0.1.0/24 [110/10] is directly connected, r1-eth0, XX:XX:XX
       C>* 10.0.1.0/24 is directly connected, r1-eth0, XX:XX:XX
      +O>* 10.0.2.0/24 [110/20] via 10.0.3.3, r1-eth1, XX:XX:XX
(3 more lines...)
Collapse Failed test_ospf_topo1_vrf test_ospf_json History
TopoTest Tests on Ubuntu 16.04 i386 6 secs
AssertionError: "r1" JSON output mismatches assert json["r1-cust1"]["areas"]["0.0.0.0"]["lsaRouterNumber"] value is different (   --- Expected value   +++ Current value   @@ -1 +1 @@   -3   +2)   json["r1-cust1"]["areas"]["0.0.0.0"]["lsaNumber"] value is different (   --- Expected value   +++ Current value   @@ -1 +1 @@   -4   +3)   json["r1-cust1"]["areas"]["0.0.0.0"]["nbrFullAdjacentCounter"] value is different (   --- Expected value   +++ Current value   @@ -1 +1 @@   -2   +1)
E   AssertionError: "r1" JSON output mismatches
    assert json["r1-cust1"]["areas"]["0.0.0.0"]["lsaRouterNumber"] value is different (
      --- Expected value
      +++ Current value
      @@ -1 +1 @@
      -3
      +2)
(12 more lines...)
Collapse Failed test_ospf_topo1_vrf test_ospf_link_down History
TopoTest Tests on Ubuntu 16.04 i386 1 min
AssertionError: OSPF did not converge on r1:   --- Current output   +++ Expected output   @@ -2,9 +2,13 @@    ============ OSPF network routing table ============    N 10.0.1.0/24 [10] area: 0.0.0.0     directly attached to r1-eth0   +N 10.0.2.0/24 [20] area: 0.0.0.0   + via 10.0.3.3, r1-eth1    N 10.0.3.0/24 [10] area: 0.0.0.0     directly attached to r1-eth1        ============ OSPF router routing table =============   +R 10.0.255.2 [10] area: 0.0.0.0, ASBR   + via 10.0.3.3, r1-eth1        ============ OSPF external routing table =========== assert False
E   AssertionError: OSPF did not converge on r1:
      --- Current output
      +++ Expected output
      @@ -2,9 +2,13 @@
       ============ OSPF network routing table ============
       N 10.0.1.0/24 [10] area: 0.0.0.0
        directly attached to r1-eth0
(11 more lines...)