FreeRangeRouting Github Pull Request Testing

Build: #6933 failed Custom build by Github Hook with revision master

Build result summary

Details

Completed
Duration
63 minutes
Flags
Custom revisionCustom build
Labels
version=frr-7_1-dev-509-g34b72a65egit=https_//github_com/frrouting/frr_gitbuildurl=https_//ci1_netdef_org/browse/frr-frrpullreq-6933branch=master
Revision
master master
Total tests
5688
Fixed in
#6934 (Custom build by Github Hook with revision master)

Custom variables

Custom revision
master master
Name Value
github_base_sha 6ac9718a2af66a796bf953e4ab9e7dd48f57754e
github_pullreq 3786
github_branch master
github_repo FRRouting/frr
github_merge_sha 34b72a65ef39fe6af0433dfc8114a4aea7371d30

Comments

  1. Github Hook

    GitHub Merge Request 3786
    for GitHub Repo FRRouting/frr, branch master

    Request to merge from mjstapp/frr
    Merge Git Commit ID 34b72a65ef39fe6af0433dfc8114a4aea7371d30 on top of base Git Commit ID 6ac9718a2af66a796bf953e4ab9e7dd48f57754e

Code commits

Author Commit Message Commit date
David Lamparter David Lamparter 50b9931b0aca6d5198761065306bfca625c50b12 50b9931b0aca6d5198761065306bfca625c50b12 Merge pull request #3936 from donaldsharp/ospf_1000_club
ospfd: When converting to ms divide by 1000

Tests

New test failures 10
Status Test View job Duration
Collapse Failed test_bgp_l3vpn_to_bgp_direct test_adjacencies History
TopoTest Tests on Ubuntu 16.04 i386 1 min
AssertionError: 2 tests failed
E   AssertionError: 2 tests failed
Collapse Failed test_bgp_rfapi_basic_sanity_config2 test_adjacencies History
TopoTest Tests on Ubuntu 16.04 i386 1 min
AssertionError: 2 tests failed
E   AssertionError: 2 tests failed
Collapse Failed test_bgp_rfapi_basic_sanity test_adjacencies History
Topology Tests on Ubuntu 18.04 amd64 1 min
AssertionError: 2 tests failed
E   AssertionError: 2 tests failed
Collapse Failed test_bgp_rfapi_basic_sanity test_adjacencies History
TopoTest Tests on Ubuntu 16.04 i386 1 min
AssertionError: 2 tests failed
E   AssertionError: 2 tests failed
Collapse Failed test_bgp test_vrf_route_leak History
Topology Tests on Ubuntu 16.04 amd64 3 secs
KeyError: '10.0.1.0/24'
E   KeyError: '10.0.1.0/24'
Collapse Failed test_bgp test_vrf_route_leak History
Topology Tests on Ubuntu 18.04 amd64 3 secs
KeyError: '10.0.0.0/24'
E   KeyError: '10.0.0.0/24'
Collapse Failed test_ospf_topo1 test_ospf6_convergence History
Topology Tests on Ubuntu 18.04 amd64 1 min
AssertionError: OSPF6 did not converge on r1:   --- Current output   +++ Expected output   @@ -1,4 +1,6 @@    *N IA 2001:db8:1::/64 :: r1-eth0   +*N IA 2001:db8:2::/64 fe80::xxxx:xxxx:xxxx:xxxx r1-eth1   + N E1 2001:db8:2::/64 fe80::xxxx:xxxx:xxxx:xxxx r1-eth1    *N IA 2001:db8:3::/64 :: r1-eth1     N E1 2001:db8:3::/64 fe80::xxxx:xxxx:xxxx:xxxx r1-eth1     fe80::xxxx:xxxx:xxxx:xxxx r1-eth1 assert False
E   AssertionError: OSPF6 did not converge on r1:
      --- Current output
      +++ Expected output
      @@ -1,4 +1,6 @@
       *N IA 2001:db8:1::/64 :: r1-eth0
      +*N IA 2001:db8:2::/64 fe80::xxxx:xxxx:xxxx:xxxx r1-eth1
      + N E1 2001:db8:2::/64 fe80::xxxx:xxxx:xxxx:xxxx r1-eth1
(4 more lines...)
Collapse Failed test_ospf_topo1 test_ospf6_link_down History
Topology Tests on Ubuntu 18.04 amd64 1 min
AssertionError: OSPF6 did not converge on r1:   --- Current output   +++ Expected output   @@ -1,3 +1,5 @@    *N IA 2001:db8:1::/64 :: r1-eth0   +*N IA 2001:db8:2::/64 fe80::xxxx:xxxx:xxxx:xxxx r1-eth1   + N E1 2001:db8:2::/64 fe80::xxxx:xxxx:xxxx:xxxx r1-eth1    *N IA 2001:db8:3::/64 :: r1-eth1     N E1 2001:db8:3::/64 fe80::xxxx:xxxx:xxxx:xxxx r1-eth1 assert False
E   AssertionError: OSPF6 did not converge on r1:
      --- Current output
      +++ Expected output
      @@ -1,3 +1,5 @@
       *N IA 2001:db8:1::/64 :: r1-eth0
      +*N IA 2001:db8:2::/64 fe80::xxxx:xxxx:xxxx:xxxx r1-eth1
      + N E1 2001:db8:2::/64 fe80::xxxx:xxxx:xxxx:xxxx r1-eth1
(3 more lines...)
Collapse Failed test_ospf_topo1 test_ospf6_kernel_route History
Topology Tests on Ubuntu 18.04 amd64 < 1 sec
AssertionError: OSPF IPv6 route mismatch in router "r4" assert expected key(s) ['2001:db8:2::/64'] in json (have ['2001:db8:100::/64', 'fe80::/64', '2001:db8:300::/64', 'unreachable', '2001:db8:3::/64', '2001:db8:200::/64', '2001:db8:1::/64']):   --- Expected value   +++ Current value   @@ -2,6 +2,45 @@   -    "2001:db8:100::/64": {},    -    "2001:db8:1::/64": {},    -    "2001:db8:200::/64": {},    -    "2001:db8:2::/64": {},    -    "2001:db8:300::/64": {},    -    "2001:db8:3::/64": {}   +    "2001:db8:100::/64": {   +        "dev": "r4-eth0",    +        "metric": "20",    +        "pref": "medium",    +        "proto": "188",    +        "via": "fe80::a811:19ff:fe8d:cee7"   +    },    +    "2001:db8:1::/64": {   +        "dev": "r4-eth0",    +        "metric": "20",    +        "pref": "medium",    +        "proto": "188",    +        "via": "fe80::a811:19ff:fe8d:cee7"   +    },    +    "2001:db8:200::/64": {   +        "dev": "r4-eth0",    +        "metric": "256",    +        "pref": "medium",    +        "proto": "kernel"   +    },    +    "2001:db8:300::/64": {   +        "dev": "r4-eth1",    +        "metric": "256",    +        "pref": "medium",    +        "proto": "kernel"   +    },    +    "2001:db8:3::/64": {   +        "dev": "r4-eth0",    +        "metric": "20",    +        "pref": "medium",    +        "proto": "188",    +        "via": "fe80::a811:19ff:fe8d:cee7"   +    },    +    "fe80::/64": {   +        "dev": "r4-eth1",    +        "metric": "256",    +        "pref": "medium",    +        "proto": "kernel"   +    },    +    "unreachable": {   +        "dev": "lo",    +        "metric": "256",    +        "pref": "medium",    +        "proto": "kernel"   +    }
E   AssertionError: OSPF IPv6 route mismatch in router "r4"
    assert expected key(s) ['2001:db8:2::/64'] in json (have ['2001:db8:100::/64', 'fe80::/64', '2001:db8:300::/64', 'unreachable', '2001:db8:3::/64', '2001:db8:200::/64', '2001:db8:1::/64']):
      --- Expected value
      +++ Current value
      @@ -2,6 +2,45 @@
      -    "2001:db8:100::/64": {}, 
      -    "2001:db8:1::/64": {}, 
(49 more lines...)
Collapse Failed test_ospf_topo1 test_ospf6_link_down_kernel_route History
Topology Tests on Ubuntu 18.04 amd64 < 1 sec
AssertionError: OSPF IPv6 route mismatch in router "r1" after link down assert expected key(s) ['2001:db8:2::/64'] in json (have ['2001:db8:3::/64', 'unreachable', 'fe80::/64', '2001:db8:1::/64']):   --- Expected value   +++ Current value   @@ -2,6 +2,24 @@   -    "2001:db8:100::/64": null,    -    "2001:db8:1::/64": {},    -    "2001:db8:200::/64": null,    -    "2001:db8:2::/64": {},    -    "2001:db8:300::/64": null,    -    "2001:db8:3::/64": {}   +    "2001:db8:1::/64": {   +        "dev": "r1-eth0",    +        "metric": "256",    +        "pref": "medium",    +        "proto": "kernel"   +    },    +    "2001:db8:3::/64": {   +        "dev": "r1-eth1",    +        "metric": "256",    +        "pref": "medium",    +        "proto": "kernel"   +    },    +    "fe80::/64": {   +        "dev": "r1-eth1",    +        "metric": "256",    +        "pref": "medium",    +        "proto": "kernel"   +    },    +    "unreachable": {   +        "dev": "lo",    +        "metric": "256",    +        "pref": "medium",    +        "proto": "kernel"   +    }
E   AssertionError: OSPF IPv6 route mismatch in router "r1" after link down
    assert expected key(s) ['2001:db8:2::/64'] in json (have ['2001:db8:3::/64', 'unreachable', 'fe80::/64', '2001:db8:1::/64']):
      --- Expected value
      +++ Current value
      @@ -2,6 +2,24 @@
      -    "2001:db8:100::/64": null, 
      -    "2001:db8:1::/64": {}, 
(28 more lines...)