FreeRangeRouting Github Pull Request Testing

Build: #7214 failed Custom build by Github Hook with revision master

Build result summary

Details

Completed
Duration
62 minutes
Flags
Custom revisionCustom build
Labels
version=frr-7_1-dev-832-gc2a230ba9git=https_//github_com/frrouting/frr_gitbuildurl=https_//ci1_netdef_org/browse/frr-frrpullreq-7214branch=master
Revision
6dc8dbf9bc64b45da40eef8c14c3e662bce237fb 6dc8dbf9bc64b45da40eef8c14c3e662bce237fb
Total tests
5322
Failing since
#7213 (Custom build by Github Hook with revision master)
Fixed in
#7215 (Custom build by Github Hook with revision master)

Tests

Custom variables

Custom revision
6dc8dbf9bc64b45da40eef8c14c3e662bce237fb 6dc8dbf9bc64b45da40eef8c14c3e662bce237fb
Name Value
github_base_sha 6dc8dbf9bc64b45da40eef8c14c3e662bce237fb
github_pullreq 4112
github_repo FRRouting/frr
github_merge_sha c2a230ba99ffbf476ff3de27055796ddb0bfb2bd
github_branch master

Comments

  1. Github Hook

    GitHub Merge Request 4112
    for GitHub Repo FRRouting/frr, branch master

    Request to merge from pguibert6WIND/frr
    Merge Git Commit ID c2a230ba99ffbf476ff3de27055796ddb0bfb2bd on top of base Git Commit ID 6dc8dbf9bc64b45da40eef8c14c3e662bce237fb

Code commits

Author Commit Message Commit date
Donald Sharp Donald Sharp 6dc8dbf9bc64b45da40eef8c14c3e662bce237fb 6dc8dbf9bc64b45da40eef8c14c3e662bce237fb Merge pull request #4115 from Wojtek242/wojtek242/doc-overview-fix
doc: replace old text with info about integrated configuration mode

Tests

New test failures 2
Status Test View job Duration
Collapse Failed test_bfd_vrf_topo1 test_bfd_fast_convergence History
TopoTest Tests on Ubuntu 16.04 i386 13 secs
AssertionError: "r1" JSON output mismatches assert json value is different (   --- Expected value   +++ Current value   @@ -2,0 +3,4 @@   +        "diagnostic": "ok",    +        "echo-interval": 50,    +        "id": 4122799996,    +        "multihop": false,    @@ -3,0 +8,4 @@   +        "receive-interval": 300,    +        "remote-diagnostic": "ok",    +        "remote-echo-interval": 50,    +        "remote-id": 1750509940,    @@ -6 +14,4 @@   -        "status": "down"   +        "status": "up",    +        "transmit-interval": 300,    +        "uptime": 18,    +        "vrf": "r1-cust1")
E   AssertionError: "r1" JSON output mismatches
    assert json value is different (
      --- Expected value
      +++ Current value
      @@ -2,0 +3,4 @@
      +        "diagnostic": "ok", 
      +        "echo-interval": 50, 
(13 more lines...)
Collapse Failed test_bfd_vrf_topo1 test_bgp_fast_reconvergence History
TopoTest Tests on Ubuntu 16.04 i386 4 secs
AssertionError: r4: bgp did not converge assert "10.254.254.1/32" should not exist in json["routes"] (have set([u'10.254.254.4/32', u'10.254.254.3/32', u'10.254.254.2/32', u'10.254.254.1/32'])):   --- Expected value   +++ Current value   @@ -1 +1,22 @@   -null   +[   +    {   +        "aspath": "102 101",    +        "bestpath": true,    +        "network": "10.254.254.1/32",    +        "nexthops": [   +            {   +                "afi": "ipv4",    +                "ip": "192.168.2.2",    +                "used": true   +            }   +        ],    +        "origin": "IGP",    +        "path": "102 101",    +        "pathFrom": "external",    +        "peerId": "192.168.2.2",    +        "prefix": "10.254.254.1",    +        "prefixLen": 32,    +        "valid": true,    +        "weight": 0   +    }   +]
E   AssertionError: r4: bgp did not converge
    assert "10.254.254.1/32" should not exist in json["routes"] (have set([u'10.254.254.4/32', u'10.254.254.3/32', u'10.254.254.2/32', u'10.254.254.1/32'])):
      --- Expected value
      +++ Current value
      @@ -1 +1,22 @@
      -null
      +[
(21 more lines...)