FreeRangeRouting Github Pull Request Testing

Build: #7228 failed Custom build by Github Hook with revision stable/5.0

Build result summary

Details

Completed
Duration
59 minutes
Flags
Custom revisionCustom build
Labels
version=frr-5_0_2-1-g1f8d7afb3git=https_//github_com/frrouting/frr_gitbuildurl=https_//ci1_netdef_org/browse/frr-frrpullreq-7228branch=stable/5_0
Revision
9e0b3541bd3bbec7453980a7873a6ef7737fbafa 9e0b3541bd3bbec7453980a7873a6ef7737fbafa
Total tests
5190
Fixed in
#7229 (Custom build by Github Hook with revision stable/5.0)

Tests

Custom variables

Custom revision
9e0b3541bd3bbec7453980a7873a6ef7737fbafa 9e0b3541bd3bbec7453980a7873a6ef7737fbafa
Name Value
github_base_sha 9e0b3541bd3bbec7453980a7873a6ef7737fbafa
github_pullreq 4122
github_repo FRRouting/frr
github_merge_sha 1f8d7afb31a92617cc0db758774337c765d23f1e
github_branch stable/5.0

Comments

  1. Github Hook

    GitHub Merge Request 4122
    for GitHub Repo FRRouting/frr, branch stable/5.0

    Request to merge from pacovn/frr
    Merge Git Commit ID 1f8d7afb31a92617cc0db758774337c765d23f1e on top of base Git Commit ID 9e0b3541bd3bbec7453980a7873a6ef7737fbafa

Code commits

Author Commit Message Commit date
Martin Winter Martin Winter 9e0b3541bd3bbec7453980a7873a6ef7737fbafa 9e0b3541bd3bbec7453980a7873a6ef7737fbafa FRRouting Release 5.0.2
Changes since 5.0.1:
 - Security Issue (Denial of Service): Fix BGP Attribute 255 (experimental VNC)
   handling
 - Fix for large AS paths
 - PIM fixes
 - BGP flowspec fixes
 - PBR fixes
 - Fix for ISIS crash
 - Add backport to build FRR on Sonic Debian

Signed-off-by: Martin Winter <mwinter@opensourcerouting.org>

Configuration changes

Plan configuration has changed since the last successful build. See the plan audit log for more details.

Tests

New test failures 3
Status Test View job Duration
Collapse Failed test_bgp_vrf_netns_topo test_bgp_vrf_learn History
Topology Tests on Ubuntu 16.04 amd64 3 secs
AssertionError: r1: Daemon bgpd not running
E   AssertionError: r1: Daemon bgpd not running
Collapse Failed test_eigrp_topo1 test_converge_protocols History
Topology Tests on Ubuntu 16.04 amd64 6 secs
AssertionError: r2: Daemon zebra not running r3: Daemon zebra not running
E   AssertionError: r2: Daemon zebra not running
    r3: Daemon zebra not running
Collapse Failed test_isis_topo1 test_isis_convergence History
Topology Tests on Ubuntu 16.04 amd64 9 secs
AssertionError: r2: Daemon isisd not running r3: Daemon isisd not running
E   AssertionError: r2: Daemon isisd not running
    r3: Daemon isisd not running