FreeRangeRouting Github Pull Request Testing

Build: #7233 failed Custom build by Github Hook with revision master

Build result summary

Details

Completed
Duration
68 minutes
Flags
Custom revisionCustom build
Labels
version=frr-7_1-dev-836-g9bde9e760git=https_//github_com/frrouting/frr_gitbuildurl=https_//ci1_netdef_org/browse/frr-frrpullreq-7233branch=master
Revision
f765a2ff8e3f2010a2ea6e63afc3d5e5cb303a6f f765a2ff8e3f2010a2ea6e63afc3d5e5cb303a6f
Total tests
5322
Fixed in
#7234 (Custom build by Github Hook with revision master)

Tests

Custom variables

Custom revision
f765a2ff8e3f2010a2ea6e63afc3d5e5cb303a6f f765a2ff8e3f2010a2ea6e63afc3d5e5cb303a6f
Name Value
github_base_sha f765a2ff8e3f2010a2ea6e63afc3d5e5cb303a6f
github_pullreq 4112
github_repo FRRouting/frr
github_merge_sha 9bde9e760c76c254016ce001255ae8f26c67ffdd
github_branch master

Comments

  1. Github Hook

    GitHub Merge Request 4112
    for GitHub Repo FRRouting/frr, branch master

    Request to merge from pguibert6WIND/frr
    Merge Git Commit ID 9bde9e760c76c254016ce001255ae8f26c67ffdd on top of base Git Commit ID f765a2ff8e3f2010a2ea6e63afc3d5e5cb303a6f

Code commits

Author Commit Message Commit date
Russ White <russ@riw.us> Russ White <russ@riw.us> f765a2ff8e3f2010a2ea6e63afc3d5e5cb303a6f f765a2ff8e3f2010a2ea6e63afc3d5e5cb303a6f Merge pull request #4081 from donaldsharp/rnh_reorder
zebra: Make rnh only send response once on first registration

Tests

New test failures 3
Status Test View job Duration
Collapse Failed test_bfd_vrf_topo1 test_bfd_fast_convergence History
TopoTest Tests on Ubuntu 16.04 i386 13 secs
AssertionError: "r1" JSON output mismatches assert json value is different (   --- Expected value   +++ Current value   @@ -2,0 +3,4 @@   +        "diagnostic": "ok",    +        "echo-interval": 50,    +        "id": 1660206876,    +        "multihop": false,    @@ -3,0 +8,4 @@   +        "receive-interval": 300,    +        "remote-diagnostic": "ok",    +        "remote-echo-interval": 50,    +        "remote-id": 2243756505,    @@ -6 +14,4 @@   -        "status": "down"   +        "status": "up",    +        "transmit-interval": 300,    +        "uptime": 17,    +        "vrf": "r1-cust1")
E   AssertionError: "r1" JSON output mismatches
    assert json value is different (
      --- Expected value
      +++ Current value
      @@ -2,0 +3,4 @@
      +        "diagnostic": "ok", 
      +        "echo-interval": 50, 
(13 more lines...)
Collapse Failed test_bfd_vrf_topo1 test_bgp_fast_reconvergence History
TopoTest Tests on Ubuntu 16.04 i386 3 secs
AssertionError: r4: bgp did not converge assert "10.254.254.1/32" should not exist in json["routes"] (have set([u'10.254.254.4/32', u'10.254.254.3/32', u'10.254.254.2/32', u'10.254.254.1/32'])):   --- Expected value   +++ Current value   @@ -1 +1,22 @@   -null   +[   +    {   +        "aspath": "102 101",    +        "bestpath": true,    +        "network": "10.254.254.1/32",    +        "nexthops": [   +            {   +                "afi": "ipv4",    +                "ip": "192.168.2.2",    +                "used": true   +            }   +        ],    +        "origin": "IGP",    +        "path": "102 101",    +        "pathFrom": "external",    +        "peerId": "192.168.2.2",    +        "prefix": "10.254.254.1",    +        "prefixLen": 32,    +        "valid": true,    +        "weight": 0   +    }   +]
E   AssertionError: r4: bgp did not converge
    assert "10.254.254.1/32" should not exist in json["routes"] (have set([u'10.254.254.4/32', u'10.254.254.3/32', u'10.254.254.2/32', u'10.254.254.1/32'])):
      --- Expected value
      +++ Current value
      @@ -1 +1,22 @@
      -null
      +[
(21 more lines...)
Collapse Failed test_bgp_l3vpn_to_bgp_vrf test_adjacencies History
Topology Tests on Ubuntu 16.04 amd64 56 secs
AssertionError: 1 tests failed
E   AssertionError: 1 tests failed